{"text_format":"1","workbook":"xlsx","n_sheets":17,"sheets":["CONTROL","Index","1a","National Overview Chart Data","1b","High Court Raw Data","High Court Chart Data","JP SC Raw Data","FY lookup","Sheriff Court lookup","Internal analytics","2b","Business Trends Chart Data","2","3","4","Sheriffdom Look up"],"not_rendered":{"charts":9,"images":8,"macros":1,"external_links":0,"defined_names":4,"comments":1,"pivot_tables":0},"unopened":[],"bounds":{"document_bytes":16777216,"sheet_cells":100000,"rows_first":2000,"rows_last":500,"rows_between":2000,"halvings":0,"cell_chars":16384,"cell_head_chars":4096},"cells_cut":0,"cells_raw":0,"read":"whole","date_system":"1900"}

{"sheet":"CONTROL","index":0,"n_rows":5,"n_cols":9,"rows_kept":5,"cut":false,"hidden":true,"merged":[]}
[]
[]
[null,null,null,null,null,null,null,"Month for division",25]
[]
[null,null,null,null,null,null,null,"Month of FY",1]

{"sheet":"Index","index":1,"n_rows":15,"n_cols":5,"rows_kept":15,"cut":false,"hidden":false,"merged":[[1,0,1,2]]}
[" "]
["Management Information showing interim monthly business volumes and trends for first instance criminal cases calling at Scottish courts during the Coronavirus pandemic. Official Statistics with full commentary are published quarterly."]
[]
["Table","Charts","Description ",null,"Geography"]
[]
["1a","1b","Time series of business volumes ",null,"National data"]
[]
["2a","2b","Time series of business trends ",null,"National data"]
[]
[]
["Worksheet"]
[2," ","Flowcharts showing how criminal cases move through Scotland's courts",null,"N/A"]
[]
[3,null,"Glossary: Explanation of Scottish court terminology",null,"N/A"]
[4,null,"Notes on data and definitions",null,"N/A"]

{"sheet":"1a","index":2,"n_rows":69,"n_cols":32,"rows_kept":69,"cut":false,"hidden":false,"merged":[[68,1,82,2],[3,1,14,1],[43,1,54,1],[56,1,67,1],[1,3,1,14],[0,5,0,6],[2,1,2,2],[16,1,27,1],[29,1,41,1]]}
[null,null,null,null,null,"Back to Index"]
[]
[null,"National overview of criminal court cases in Scotland",null,"2020-04-01","2020-05-01","2020-06-01","2020-07-01","2020-08-01","2020-09-01","2020-10-01","2020-11-01","2020-12-01","2021-01-01","2021-02-01","2021-03-01","2021-04-01","2021-05-01","2021-06-01","2021-07-01","2021-08-01","2021-09-01","2021-10-01","2021-11-01","2021-12-01","2022-01-01","2022-02-01","2022-03-01","2022-04-01","2022/23 YTD",null,"2019/20","2019/20  monthly average"]
[null,"All Criminal courts","National total of cases registered (not including petitions) ",{"$f":"IF(SUM(D17,D31,D44,D57)=0,\"\",(SUM(D17,D31,D44,D57)))","v":5306},4561,5720,8558,7643,7333,6903,6050,5858,5703,5465,7560,7505,6909,7136,6743,7214,7124,7166,7399,7235,6894,6233,8009,{"$f":"IF(SUM(AB17,AB31,AB44,AB57)=0,\"\",(SUM(AB17,AB31,AB44,AB57)))","v":6814},{"$f":"SUM(AB4)","v":6814},null,{"$f":"SUM(AE17,AE31,AE44,AE57)","v":105548},{"$f":"AE4/12","v":8795.6666666666661}]
[null,null,"National total of cases that called at a first hearing",{"$f":"IF(SUM(D18,D32,D45,D58)=0,\"\",(SUM(D18,D32,D45,D58)))","v":3401},3843,3864,8401,7799,7040,6641,5861,6020,6013,4012,6596,6058,5829,6663,7111,6837,6856,7018,7141,7151,6998,5441,7885,{"$f":"IF(SUM(AB18,AB32,AB45,AB58)=0,\"\",(SUM(AB18,AB32,AB45,AB58)))","v":6937},{"$f":"SUM(AB5)","v":6937},null,{"$f":"SUM(AE18,AE32,AE45,AE58)","v":100922},{"$f":"AE5/12","v":8410.1666666666661}]
[null,null,"National total of cases that called at a continued first hearing",{"$f":"IF(SUM(D19,D33,D46,D59)=0,\"\",(SUM(D19,D33,D46,D59)))","v":2023},2320,2724,3896,7105,8751,7686,6799,6372,5434,2421,4453,4541,6260,7980,8583,6724,5455,4575,4610,4377,4252,4621,4249,{"$f":"IF(SUM(AB19,AB33,AB46,AB59)=0,\"\",(SUM(AB19,AB33,AB46,AB59)))","v":4570},4570,null,{"$f":"SUM(AE19,AE33,AE46,AE59)","v":36514},{"$f":"AE6/12","v":3042.8333333333335}]
[null,null,"National total of Section 76 (Solemn business only)",{"$f":"IF(SUM(D20,D34)=0,\"\",(SUM(D20,D34)))","v":55},60,77,99,108,128,98,92,82,65,84,81,88,108,120,101,105,93,74,97,98,79,113,109,{"$f":"IF(SUM(AB20,AB34)=0,\"\",(SUM(AB20,AB34)))","v":102},102,null,{"$f":"SUM(AE20,AE34)","v":1142},{"$f":"AE7/12","v":95.166666666666671}]
[null,null,"National total of intermediate diets called (Summary business only)",{"$f":"IF(SUM(D47,D60)=0,\"\",(SUM(D47,D60)))","v":3402},2356,827,2706,8717,9188,9359,8003,7740,9143,6708,7397,6982,7182,7983,8482,10084,10501,6398,10059,8927,10866,10420,{"$f":"IF(SUM(AA47,AA60)=0,\"\",(SUM(AA47,AA60)))","v":11243},9742,9742,null,{"$f":"SUM(AE47,AE60)","v":89847},7487.25]
[null,null,"National total of trials called ",{"$f":"IF(SUM(D21,D35,D48,D61)=0,\"\",SUM(D21,D35,D48,D61))","v":1019},476,192,355,2811,3950,3980,4386,3868,4882,1200,3101,3167,3649,4577,5062,5917,6778,5449,4420,5882,5648,6472,8276,{"$f":"IF(SUM(AB21,AB35,AB48,AB61)=0,\"\",SUM(AB21,AB35,AB48,AB61))","v":6556},6556,null,{"$f":"SUM(AE21,AE35,AE48,AE61)","v":54744},4562]
[null,null,"National total of trials called where evidence was led",{"$f":"IF(SUM(D22,D36,D49,D62)=0,\"\",SUM(D22,D36,D49,D62))","v":5},9,24,84,320,526,575,627,512,276,186,401,470,558,622,583,664,775,626,541,549,536,754,827,{"$f":"IF(SUM(AB22,AB36,AB49,AB62)=0,\"\",SUM(AB22,AB36,AB49,AB62))","v":691},691,null,{"$f":"SUM(AE22,AE36,AE49,AE62)","v":10121},843.41666666666663]
[null,null,"National total of trials adjourned due to lack of court time",{"$f":"SUM(D23,D37,D50,D63)","v":0},{"$f":"SUM(E23,E37,E50,E63)","v":0},{"$f":"SUM(F23,F37,F50,F63)","v":0},{"$f":"SUM(G23,G37,G50,G63)","v":8},{"$f":"SUM(H23,H37,H50,H63)","v":24},{"$f":"IF(SUM(I23,I37,I50,I63)=0,\"\",SUM(I23,I37,I50,I63))","v":50},65,63,103,15,10,33,75,92,116,96,130,123,140,94,100,71,121,101,{"$f":"IF(SUM(AB23,AB37,AB50,AB63)=0,\"\",SUM(AB23,AB37,AB50,AB63))","v":129},{"$f":"SUM(AB11)","v":129},null,{"$f":"SUM(AE23,AE37,AE50,AE63)","v":1574},131.16666666666666]
[null,null,"Percentage of trials adjourned due to lack of court time",{"$f":"IFERROR(SUM(D11/D9),\"\")","v":0},{"$f":"IFERROR(SUM(E11/E9),\"\")","v":0},0,2.2535211267605635E-2,{"$f":"IFERROR(SUM(H11/H9),\"\")","v":8.5378868729989333E-3},{"$f":"IFERROR(SUM(I11/I9),\"\")","v":1.2658227848101266E-2},{"$f":"IFERROR(SUM(J11/J9),\"\")","v":1.6331658291457288E-2},{"$f":"IFERROR(SUM(K11/K9),\"\")","v":1.4363885088919288E-2},{"$f":"IFERROR(SUM(L11/L9),\"\")","v":2.6628748707342297E-2},{"$f":"IFERROR(SUM(M11/M9),\"\")","v":3.0725112658746417E-3},8.3333333333333332E-3,1.0641728474685586E-2,{"$f":"IFERROR(SUM(P11/P9),0)","v":2.3681717713924851E-2},2.5212386955330228E-2,{"$f":"IFERROR(SUM(R11/R9),0)","v":2.5344111863666158E-2},{"$f":"IFERROR(SUM(S11/S9),0)","v":1.8964836033188465E-2},2.1970593206016562E-2,{"$f":"IFERROR(SUM(U11/U9),0)","v":1.8146946001770435E-2},2.5692787667461921E-2,2.1266968325791856E-2,1.7001020061203673E-2,1.2570821529745042E-2,{"$f":"IFERROR(SUM(Z11/Z9),0)","v":1.869592088998764E-2},{"$f":"IFERROR(SUM(AA11/AA9),0)","v":1.220396326727888E-2},{"$f":"IFERROR(SUM(AB11/AB9),0)","v":1.9676632092739475E-2},{"$f":"IFERROR(SUM(AC11/AC9),0)","v":1.9676632092739475E-2},null,{"$f":"SUM(AE11/AE9)","v":2.875200935262312E-2},{"$f":"SUM(AF11/AF9)","v":2.8752009352623117E-2}]
[null,null,"National total of cases concluded",{"$f":"IF(SUM(D25,D39,D52,D65)=0,\"\",SUM(D25,D39,D52,D65))","v":586},930,1519,2892,5792,6959,6407,6257,5922,3070,2226,3599,4188,4996,7085,7989,7978,8185,6594,6579,6610,6041,7220,8682,{"$f":"IF(SUM(AB25,AB39,AB52,AB65)=0,\"\",SUM(AB25,AB39,AB52,AB65))","v":7621},{"$f":"SUM(AB13)","v":7621},null,{"$f":"SUM(AE25,AE39,AE52,AE65)","v":93903},{"$f":"AE13/12","v":7825.25}]
[null,null,"National total of trials scheduled at end of period",{"$f":"IF(SUM(D27,D41,D54,D67)=0,\"\",SUM(D27,D41,D54,D67))","v":18074},20236,22437,25900,28351,30956,32427,33590,34283,35067,36037,37801,39488,40882,42451,43341,43526,42554,42796,43597,43016,43606,42503,40923,{"$f":"IF(SUM(AB27,AB41,AB54,AB67)=0,\"\",SUM(AB27,AB41,AB54,AB67))","v":39958},{"$f":"IF(SUM(AC27,AC41,AC54,AC67)=0,\"\",SUM(AC27,AC41,AC54,AC67))","v":39958},null,{"$f":"SUM(AE27,AE41,AE54,AE67)","v":18355},18355]
[null,null,"National Forecast Scheduled Trials as at end of period3",{"$f":"IF(SUM(D28,D42,D55,D68)=0,\"\",SUM(D28,D42,D55,D68))","v":20942.420000000002},23435.710000000003,26586.52,31070.46,34091.429999999993,36273.239999999991,37857.419999999991,38816.789999999994,39973.1,41720.509999999995,43642.119999999995,45935.259999999995,47211.58,47705.02,47567.41,47018.86,46078.609999999993,44530.52,44335.409999999996,45105.82,44518.2,45111.81,44090.01,42382.38,{"$f":"IF(SUM(AB28,AB42,AB55,AB68)=0,\"\",SUM(AB28,AB42,AB55,AB68))","v":41382.44}]
[null," "]
[null,"High Court ","Indictments registered ",77,85,69,63,46,68,60,32,48,65,64,90,55,43,57,66,37,57,69,54,69,68,90,80,77,{"$f":"SUM(AB17)","v":77},null,{"$f":"SUMIFS('High Court Raw Data'!$E:$E,'High Court Raw Data'!$A:$A,\"2019/20\")","v":1024},{"$f":"AE17/12","v":85.333333333333329}]
[null,null,"Indictments called at Preliminary Hearing",12,2,78,172,77,65,60,52,38,47,56,66,69,49,55,35,40,37,59,29,47,64,60,94,99,{"$f":"SUM(AB18)","v":99},null,{"$f":"SUMIFS('High Court Raw Data'!$F:$F,'High Court Raw Data'!$A:$A,\"2019/20\")","v":981},{"$f":"AE18/12","v":81.75}]
[null,null,"Indictments called at Continued Preliminary Hearing",5,5,30,76,98,115,97,78,72,87,66,62,62,57,66,57,89,82,63,57,49,49,36,49,48,48,null,{"$f":"SUMIFS('High Court Raw Data'!$G:$G,'High Court Raw Data'!$A:$A,\"2019/20\")","v":437},{"$f":"AE19/12","v":36.416666666666664}]
[null,null,"Section 76 Indictments",6,6,5,6,5,15,6,9,3,7,11,5,5,4,10,6,7,7,4,7,6,5,8,9,7,7,null,{"$f":"SUMIFS('High Court Raw Data'!$H:$H,'High Court Raw Data'!$A:$A,\"2019/20\")","v":94},7.833333333333333]
[null,null,"Trials called ",0,0,0,4,14,26,42,58,47,56,67,66,46,60,67,58,74,64,65,81,38,62,64,73,73,73,null,{"$f":"SUMIFS('High Court Raw Data'!$I:$I,'High Court Raw Data'!$A:$A,\"2019/20\")","v":812},67.666666666666671]
[null,null,"Trials called where evidence was led",0,0,0,4,14,18,28,49,29,43,42,51,34,43,47,48,55,47,54,63,30,47,54,55,50,50,null,{"$f":"SUMIFS('High Court Raw Data'!$J:$J,'High Court Raw Data'!$A:$A,\"2019/20\")","v":498},41.5]
[null,null,"Trials adjourned due to lack of court time",0,0,0,0,0,0,2,1,9,0,0,0,3,5,3,2,2,1,0,0,0,0,0,4,6,6,null,{"$f":"SUMIFS('High Court Raw Data'!$K:$K,'High Court Raw Data'!$A:$A,\"2019/20\")","v":49},{"$f":"AE23/12","v":4.083333333333333}]
[null,null,"Percentage of trials adjourned due to lack of court time",{"$f":"IFERROR(SUM(D23/D21),0)","v":0},{"$f":"IFERROR(SUM(E23/E21),0)","v":0},0,0,0,0,4.7619047619047616E-2,{"$f":"IFERROR(SUM(K23/K21),0)","v":1.7241379310344827E-2},{"$f":"IFERROR(SUM(L23/L21),0)","v":0.19148936170212766},{"$f":"IFERROR(SUM(M23/M21),0)","v":0},{"$f":"IFERROR(SUM(N23/N21),0)","v":0},{"$f":"IFERROR(SUM(O23/O21),0)","v":0},{"$f":"IFERROR(SUM(P23/P21),0)","v":6.5217391304347824E-2},{"$f":"IFERROR(SUM(Q23/Q21),0)","v":8.3333333333333329E-2},{"$f":"IFERROR(SUM(R23/R21),0)","v":4.4776119402985072E-2},3.4482758620689655E-2,2.7027027027027029E-2,1.5625E-2,0,0,0,{"$f":"IFERROR(SUM(Y23/Y21),0)","v":0},0,5.4794520547945202E-2,{"$f":"IFERROR(SUM(AB23/AB21),0)","v":8.2191780821917804E-2},{"$f":"IFERROR(SUM(AC23/AC21),0)","v":8.2191780821917804E-2},null,{"$f":"SUM(AE23/AE21)","v":6.0344827586206899E-2},{"$f":"SUM(AF23/AF21)","v":6.0344827586206885E-2}]
[null,null,"Indictments concluded",7,9,14,32,35,20,39,54,54,55,72,64,53,58,62,58,76,62,70,82,56,45,57,77,66,66,null,{"$f":"SUMIFS('High Court Raw Data'!$M:$M,'High Court Raw Data'!$A:$A,'High Court Raw Data'!$S$3)","v":806},{"$f":"AE25/12","v":67.166666666666671}]
[null,null,"Average time between pleading diet and evidence led trial, where evidence led trial occurred in the period shown (weeks)",20,"N/A","N/A",21,34,35,50,52,54,52,54,66,58,51,50,55,51,54,50,50.993333300000003,57,62,48,48,49,{"$f":"AB26","v":49},null,null,22.1]
[null,null,"Trials scheduled at end of period",390,390,390,386,375,360,335,291,250,215,247,267,292,304,313,325,432,389,444,476,516,534,535,560,609,{"$f":"AB27","v":609},null,{"$f":"SUMIFS('High Court Raw Data'!$L:$L,'High Court Raw Data'!$A:$A,'High Court Raw Data'!$S$3,'High Court Raw Data'!B:B,'High Court Raw Data'!$T$3)","v":390},390]
[null,null,"Forecast Scheduled Trials as at end of period3",{"$f":"390+(0.8*D17)-'Internal analytics'!F9","v":451.6},{"$f":"D28+(0.8*E17)-'Internal analytics'!G9","v":519.6},{"$f":"E28+(0.8*F17)-'Internal analytics'!H9","v":574.80000000000007},{"$f":"F28+(0.8*G17)-'Internal analytics'!I9","v":621.20000000000005},{"$f":"G28+(0.8*H17)-'Internal analytics'!J9","v":647},{"$f":"H28+(0.8*I17)-'Internal analytics'!K9","v":686.4},{"$f":"I28+(0.8*J17)-'Internal analytics'!L9","v":709.4},715,724,{"$f":"L28+(0.8*M17)-'Internal analytics'!O9","v":741},{"$f":"M28+(0.8*N17)-'Internal analytics'!P9","v":745.2},{"$f":"N28+(0.8*O17)-'Internal analytics'!Q9","v":773.2},{"$f":"O28+(0.8*P17)-'Internal analytics'!R9","v":781.2},{"$f":"P28+(0.8*Q17)-'Internal analytics'!S9","v":785.6},{"$f":"Q28+(0.8*R17)-'Internal analytics'!T9","v":784.2},{"$f":"R28+(0.8*S17)-'Internal analytics'!U9","v":787},{"$f":"S28+(0.8*T17)-'Internal analytics'!V9","v":763.6},{"$f":"T28+(0.8*U17)-'Internal analytics'!W9","v":762.2},{"$f":"U28+(0.8*V17)-'Internal analytics'!X9","v":760.40000000000009},{"$f":"V28+(0.8*W17)-'Internal analytics'!Y9","v":750.60000000000014},{"$f":"W28+(0.8*X17)-'Internal analytics'!Z9","v":759.80000000000018},{"$f":"X28+(0.8*Y17)-'Internal analytics'!AA9","v":780.20000000000016},{"$f":"Y28+(0.8*Z17)-'Internal analytics'!AB9","v":802.20000000000016},{"$f":"Z28+(0.8*AA17)-'Internal analytics'!AC9","v":802.20000000000016},{"$f":"AA28+(0.8*AB17)-'Internal analytics'!AD9","v":815.80000000000018}]
[]
[null,"Sheriff Court - Solemn business","Petitions registered",641,844,1032,1068,1081,1061,935,890,786,771,896,1071,1011,945,953,989,1059,944,897,1090,848,1025,942,1066,952,{"$f":"SUM(AB30)","v":952},null,{"$f":"SUMIFS('JP SC Raw Data'!$G:$G,'JP SC Raw Data'!$F:$F,\"S\",'JP SC Raw Data'!$B:$B,\"2019/20\",'JP SC Raw Data'!$E:$E,\"National\")","v":9780},{"$f":"AE30/12","v":815}]
[null,null,"Indictments registered",219,319,355,467,496,494,492,414,428,379,378,410,441,532,471,520,447,481,479,541,450,425,525,447,421,{"$f":"SUM(AB31)","v":421},null,{"$f":"SUMIFS('JP SC Raw Data'!$H:$H,'JP SC Raw Data'!$F:$F,\"S\",'JP SC Raw Data'!$B:$B,\"2019/20\",'JP SC Raw Data'!$E:$E,\"National\")","v":5452},454.33333333333331]
[null,null,"Indictments called at First Diet",311,234,222,322,341,538,467,424,433,464,370,469,432,443,496,468,485,419,450,487,428,481,430,614,450,450,null,{"$f":"SUMIFS('JP SC Raw Data'!$I:$I,'JP SC Raw Data'!$F:$F,\"S\",'JP SC Raw Data'!$B:$B,\"2019/20\",'JP SC Raw Data'!$E:$E,\"National\")","v":5114},426.16666666666669]
[null,null,"Indictments called at Continued First Diet",125,127,119,464,486,539,525,724,828,844,868,1017,907,869,898,866,771,730,681,791,564,573,630,687,628,628,null,{"$f":"SUMIFS('JP SC Raw Data'!$J:$J,'JP SC Raw Data'!$F:$F,\"S\",'JP SC Raw Data'!$B:$B,\"2019/20\",'JP SC Raw Data'!$E:$E,\"National\")","v":2963},246.91666666666666]
[null,null,"Section 76 indictments",49,54,72,93,103,113,92,83,79,58,73,76,83,104,110,95,98,86,70,90,92,74,105,100,95,95,null,{"$f":"SUMIFS('JP SC Raw Data'!$K:$K,'JP SC Raw Data'!$F:$F,\"S\",'JP SC Raw Data'!$B:$B,\"2019/20\",'JP SC Raw Data'!$E:$E,\"National\")","v":1048},87.333333333333329]
[null,null,"Trials called  ",91,33,31,37,146,119,73,147,78,161,285,388,362,368,383,340,392,396,393,273,263,368,433,488,425,425,null,{"$f":"SUMIFS('JP SC Raw Data'!$L:$L,'JP SC Raw Data'!$F:$F,\"S\",'JP SC Raw Data'!$B:$B,\"2019/20\",'JP SC Raw Data'!$E:$E,\"National\")","v":3142},261.83333333333331]
[null,null,"Trials called where evidence was led",0,0,0,0,0,0,0,0,11,30,56,100,84,82,88,76,83,95,70,48,52,56,78,95,75,75,null,{"$f":"SUMIFS('JP SC Raw Data'!$M:$M,'JP SC Raw Data'!$F:$F,\"S\",'JP SC Raw Data'!$B:$B,\"2019/20\",'JP SC Raw Data'!$E:$E,\"National\")","v":1134},94.5]
[null,null,"Trials adjourned due to lack of court time",0,0,0,0,0,0,0,0,0,4,9,22,29,30,17,25,23,21,34,18,28,13,24,31,37,37,null,{"$f":"SUMIFS('JP SC Raw Data'!$N:$N,'JP SC Raw Data'!$F:$F,\"S\",'JP SC Raw Data'!$B:$B,\"2019/20\",'JP SC Raw Data'!$E:$E,\"National\")","v":57},4.75]
[null,null,"Percentage of trials adjourned due to lack of court time",{"$f":"IFERROR(SUM(D37/D35),0)","v":0},{"$f":"IFERROR(SUM(E37/E35),0)","v":0},0,0,0,0,0,0,0,{"$f":"IFERROR(SUM(M37/M35),0)","v":2.4844720496894408E-2},{"$f":"IFERROR(SUM(N37/N35),0)","v":3.1578947368421054E-2},{"$f":"IFERROR(SUM(O37/O35),0)","v":5.6701030927835051E-2},{"$f":"IFERROR(SUM(P37/P35),0)","v":8.0110497237569064E-2},{"$f":"IFERROR(SUM(Q37/Q35),0)","v":8.1521739130434784E-2},{"$f":"IFERROR(SUM(R37/R35),0)","v":4.4386422976501305E-2},{"$f":"IFERROR(SUM(S37/S35),0)","v":7.3529411764705885E-2},5.8673469387755105E-2,5.3030303030303032E-2,8.6513994910941472E-2,6.5934065934065936E-2,{"$f":"IFERROR(SUM(X37/X35),0)","v":0.10646387832699619},3.5326086956521736E-2,5.5427251732101619E-2,6.3524590163934427E-2,8.7058823529411758E-2,8.7058823529411758E-2,null,{"$f":"SUM(AE37/AE35)","v":1.8141311266709103E-2},1.8141311266709103E-2]
[null,null,"Indictments concluded",140,127,166,174,284,358,322,276,300,317,354,468,463,442,459,453,451,439,403,414,363,357,427,461,475,475,null,{"$f":"SUMIFS('JP SC Raw Data'!$P:$P,'JP SC Raw Data'!$F:$F,\"S\",'JP SC Raw Data'!$B:$B,\"2019/20\",'JP SC Raw Data'!$E:$E,\"National\")","v":5155},{"$f":"AE39/12","v":429.58333333333331}]
[null,null,"Average time between pleading diet and evidence led trial, where evidence led trial occurred in the period shown (weeks)","N/A","N/A","N/A","N/A","N/A","N/A","N/A","N/A",29.975454545454546,32.182999999999993,35.683749999999996,37,38.311309523809513,43.999390243902425,41.658181818181816,41.361184210526318,44.76650602409638,42.948947368421059,41.784857142857149,48.342916670000001,41,40.6616071428571,44.063209999999998,45.251368421052597,40.514270000000003,{"$f":"AB40","v":40.514270000000003},null,null,11]
[null,null,"Trials scheduled at end of period",497,497,497,497,553,613,648,738,939,1091,1211,1329,1398,1479,1595,1684,1781,1842,1923,2053,2170,2212,2196,2274,2267,{"$f":"AB41","v":2267},null,{"$f":"SUMIFS('JP SC Raw Data'!$O:$O,'JP SC Raw Data'!$B:$B,'JP SC Raw Data'!$AD$2,'JP SC Raw Data'!$C:$C,'JP SC Raw Data'!$AE$2,'JP SC Raw Data'!$D:$D,\"0\")","v":497},497]
[null,null,"Forecast Scheduled Trials as at end of period3",{"$f":"497+(0.71*(D31-D34))-'Internal analytics'!F19","v":588.70000000000005},{"$f":"D42+(0.71*(E31-E34))-'Internal analytics'!G19","v":764.85},{"$f":"E42+(0.71*(F31-F34))-'Internal analytics'!H19","v":957.78},{"$f":"F42+(0.71*(G31-G34))-'Internal analytics'!I19","v":1216.32},{"$f":"G42+(0.71*(H31-H34))-'Internal analytics'!J19","v":1479.35},{"$f":"H42+(0.71*(I31-I34))-'Internal analytics'!K19","v":1736.86},{"$f":"I42+(0.71*(J31-J34))-'Internal analytics'!L19","v":2000.86},{"$f":"J42+(0.71*(K31-K34))-'Internal analytics'!M19","v":2211.87},{"$f":"K42+(0.71*(L31-L34))-'Internal analytics'!N19","v":2435.66},{"$f":"L42+(0.71*(M31-M34))-'Internal analytics'!O19","v":2591.5699999999997},{"$f":"M42+(0.71*(N31-N34))-'Internal analytics'!P19","v":2644.12},{"$f":"N42+(0.71*(O31-O34))-'Internal analytics'!Q19","v":2669.2599999999998},{"$f":"O42+(0.71*(P31-P34))-'Internal analytics'!R19","v":2720.4399999999996},{"$f":"P42+(0.71*(Q31-Q34))-'Internal analytics'!S19","v":2830.3199999999997},{"$f":"Q42+(0.71*(R31-R34))-'Internal analytics'!T19","v":2869.6299999999997},{"$f":"R42+(0.71*(S31-S34))-'Internal analytics'!U19","v":2974.3799999999997},{"$f":"S42+(0.71*(T31-T34))-'Internal analytics'!V19","v":3008.1699999999996},{"$f":"T42+(0.71*(U31-U34))-'Internal analytics'!W19","v":3057.6199999999994},{"$f":"U42+(0.71*(V31-V34))-'Internal analytics'!X19","v":3146.0099999999993},{"$f":"V42+(0.71*(W31-W34))-'Internal analytics'!Y19","v":3287.2199999999993},{"$f":"W42+(0.71*(X31-X34))-'Internal analytics'!Z19","v":3428.3999999999992},{"$f":"X42+(0.71*(Y31-Y34))-'Internal analytics'!AA19","v":3471.6099999999992},{"$f":"Y42+(0.71*(Z31-Z34))-'Internal analytics'!AB19","v":3515.809999999999},{"$f":"Z42+(0.71*(AA31-AA34))-'Internal analytics'!AC19","v":3491.1799999999989},{"$f":"AA42+(0.71*(AB31-AB34))-'Internal analytics'!AD19","v":3484.639999999999}]
[]
[null,"Sheriff Court -Summary business","Complaints registered",3016,3247,4309,6205,6037,5855,4634,4383,3956,3790,3678,5000,5017,4603,4544,4440,4718,4453,4510,4770,4860,4614,4007,4970,4423,{"$f":"SUM(AB44)","v":4423},null,{"$f":"SUMIFS('JP SC Raw Data'!$Q:$Q,'JP SC Raw Data'!$F:$F,\"S\",'JP SC Raw Data'!$B:$B,\"2019/20\",'JP SC Raw Data'!$E:$E,\"National\")","v":65490},{"$f":"AE44/12","v":5457.5}]
[null,null,"Complaints called for first time ",1896,2835,3026,6173,5983,5665,4629,4128,3985,3662,3001,4525,4502,4565,4455,4549,4383,4362,4366,4477,4744,4610,3690,4654,4253,{"$f":"SUM(AB45)","v":4253},null,{"$f":"SUMIFS('JP SC Raw Data'!$R:$R,'JP SC Raw Data'!$F:$F,\"S\",'JP SC Raw Data'!$B:$B,\"2019/20\",'JP SC Raw Data'!$E:$E,\"National\")","v":61761},5146.75]
[null,null,"Complaints called for 'Continued Without Plea' hearing",899,1252,1675,2216,3243,4258,4078,3231,2951,2376,861,1892,2520,3591,3495,2534,2020,1860,1693,1702,1770,1932,2142,1906,1982,1982,null,{"$f":"SUMIFS('JP SC Raw Data'!$S:$S,'JP SC Raw Data'!$F:$F,\"S\",'JP SC Raw Data'!$B:$B,\"2019/20\",'JP SC Raw Data'!$E:$E,\"National\")","v":14851},1237.5833333333333]
[null,null,"Complaints called in Intermediate Diet court",2702,1910,721,2341,7152,7350,7563,6499,6293,7369,5777,6550,6324,6499,6697,7002,8286,8495,5130,8376,7274,8940,8563,9132,7868,7868,null,{"$f":"SUMIFS('JP SC Raw Data'!$T:$T,'JP SC Raw Data'!$F:$F,\"S\",'JP SC Raw Data'!$B:$B,\"2019/20\",'JP SC Raw Data'!$E:$E,\"National\")","v":70652},{"$f":"AE47/12","v":5887.666666666667}]
[null,null,"Trials called",802,372,154,291,2343,3107,3207,3443,3090,3805,737,2371,2657,3171,3887,4169,4499,5443,4266,3428,4703,4537,5093,6599,5094,5094,null,{"$f":"SUMIFS('JP SC Raw Data'!$U:$U,'JP SC Raw Data'!$F:$F,\"S\",'JP SC Raw Data'!$B:$B,\"2019/20\",'JP SC Raw Data'!$E:$E,\"National\")","v":40729},3394.0833333333335]
[null,null,"Trials called where evidence was led",5,9,24,79,283,440,479,491,399,176,86,250,352,433,471,408,459,551,439,385,422,427,552,604,505,505,null,{"$f":"SUMIFS('JP SC Raw Data'!$V:$V,'JP SC Raw Data'!$F:$F,\"S\",'JP SC Raw Data'!$B:$B,\"2019/20\",'JP SC Raw Data'!$E:$E,\"National\")","v":6946},578.83333333333337]
[null,null,"Trials adjourned due to lack of court time",0,0,0,8,21,40,50,57,90,9,1,11,43,57,96,67,91,94,101,68,64,58,88,56,76,76,null,{"$f":"SUMIFS('JP SC Raw Data'!$W:$W,'JP SC Raw Data'!$F:$F,\"S\",'JP SC Raw Data'!$B:$B,\"2019/20\",'JP SC Raw Data'!$E:$E,\"National\")","v":1230},102.5]
[null,null,"Percentage of trials adjourned due to lack of court time",{"$f":"IFERROR(SUM(D50/D48),0)","v":0},{"$f":"IFERROR(SUM(E50/E48),0)","v":0},0,2.7491408934707903E-2,8.9628681177976958E-3,1.2874155133569359E-2,1.5590894917368257E-2,{"$f":"IFERROR(SUM(K50/K48),0)","v":1.6555329654371186E-2},{"$f":"IFERROR(SUM(L50/L48),0)","v":2.9126213592233011E-2},{"$f":"IFERROR(SUM(M50/M48),0)","v":2.3653088042049934E-3},{"$f":"IFERROR(SUM(N50/N48),0)","v":1.3568521031207597E-3},4.6393926613243356E-3,1.6183665788483251E-2,1.7975402081362345E-2,{"$f":"IFERROR(SUM(R50/R48),0)","v":2.4697710316439414E-2},1.6071000239865674E-2,2.022671704823294E-2,1.726988792945067E-2,2.36755743084857E-2,1.9836639439906652E-2,{"$f":"IFERROR(SUM(X50/X48),0)","v":1.3608335105251966E-2},1.278377782675777E-2,1.7278617710583154E-2,8.4861342627670852E-3,1.49195131527287E-2,1.49195131527287E-2,null,{"$f":"SUM(AE50/AE48)","v":3.0199612070023817E-2},3.0199612070023814E-2]
[null,null,"Complaints concluded",429,744,1146,2227,4084,4759,4395,4244,3944,2071,1665,2735,3466,4181,4547,4446,4654,5186,4099,4162,4410,4126,4995,5929,4987,{"$f":"SUM(AB52)","v":4987},null,{"$f":"SUMIFS('JP SC Raw Data'!$Y:$Y,'JP SC Raw Data'!$F:$F,\"S\",'JP SC Raw Data'!$B:$B,\"2019/20\",'JP SC Raw Data'!$E:$E,\"National\")","v":57256},{"$f":"AE52/12","v":4771.333333333333}]
[null,null,"Average time between pleading diet and evidence led trial, where evidence led trial occurred in the period shown (weeks)",7.0840000000000005,3.8433333333333337,11.475000000000001,21.380506329113924,34.065795053003527,37.83834090909091,35.172505219206677,33.833217922606913,34.112481203007512,36.059147727272737,35.496279069767454,34.892799999999994,34.803607954545448,36.660762124711319,41.735180467091311,44.970416666666679,45.601045751633997,48.230235934664236,47.259476082004547,45.570300000000003,46.966099999999997,49.673279999999998,52.493639999999999,50.456589403973503,52.718000000000004,{"$f":"AB53","v":52.718000000000004},null,null,23]
[null,null,"Trials scheduled at end of period",13967,15854,17818,20929,22932,25146,26370,27372,27723,28548,29324,30645,31799,32778,33598,33602,33369,32433,32488,33015,32394,32759,31904,30520,29793,{"$f":"AB54","v":29793},null,{"$f":"SUMIFS('JP SC Raw Data'!$X:$X,'JP SC Raw Data'!$B:$B,'JP SC Raw Data'!$AD$2,'JP SC Raw Data'!$C:$C,'JP SC Raw Data'!$AE$2,'JP SC Raw Data'!$D:$D,\"0\")","v":13971},13971]
[null,null,"Forecast Scheduled Trials as at end of period3",{"$f":"13971+(0.62*D44)-'Internal analytics'!F29","v":15807.92},{"$f":"D55+(0.62*E44)-'Internal analytics'!G29","v":17787.060000000001},{"$f":"E55+(0.62*F44)-'Internal analytics'!H29","v":20396.64},{"$f":"F55+(0.62*G44)-'Internal analytics'!I29","v":24039.739999999998},{"$f":"G55+(0.62*H44)-'Internal analytics'!J29","v":26583.679999999997},{"$f":"H55+(0.62*I44)-'Internal analytics'!K29","v":28556.779999999995},{"$f":"I55+(0.62*J44)-'Internal analytics'!L29","v":29687.859999999993},{"$f":"J55+(0.62*K44)-'Internal analytics'!M29","v":30471.319999999992},{"$f":"K55+(0.62*L44)-'Internal analytics'!N29","v":31313.039999999994},{"$f":"L55+(0.62*M44)-SUM('Internal analytics'!O29+'Internal analytics'!O32)","v":32618.839999999997},{"$f":"M55+(0.62*N44)-SUM('Internal analytics'!P29+'Internal analytics'!P32)","v":34119.199999999997},{"$f":"N55+(0.62*O44)-SUM('Internal analytics'!Q29+'Internal analytics'!Q32)","v":35751.199999999997},{"$f":"O55+(0.62*P44)-SUM('Internal analytics'!R29,'Internal analytics'!R32,'Internal analytics'!R33)","v":36406.74},{"$f":"P55+(0.62*Q44)-SUM('Internal analytics'!S29,'Internal analytics'!S32,'Internal analytics'!S33)","v":36309.599999999999},{"$f":"Q55+(0.62*R44)-SUM('Internal analytics'!T29,'Internal analytics'!T32,'Internal analytics'!T33)","v":35790.879999999997},{"$f":"R55+(0.62*S44)-SUM('Internal analytics'!U29,'Internal analytics'!U32,'Internal analytics'!U33)","v":35144.68},{"$f":"S55+(0.62*T44)-SUM('Internal analytics'!V29,'Internal analytics'!V32,'Internal analytics'!V33)","v":34362.839999999997},{"$f":"T55+(0.62*U44)-SUM('Internal analytics'!W29,'Internal analytics'!W32,'Internal analytics'!W33)","v":32820.699999999997},{"$f":"V54","v":32488},33015,32394,32759,31904,30520,{"$f":"AB54","v":29793}]
[]
[null,"Justice of the Peace Court ","Complaints registered during period",1994,910,987,1823,1064,916,1717,1221,1426,1469,1345,2060,1992,1731,2064,1717,2012,2133,2108,2034,1856,1787,1611,2512,1893,{"$f":"SUM(AB57)","v":1893},null,{"$f":"SUMIFS('JP SC Raw Data'!$Q:$Q,'JP SC Raw Data'!$F:$F,\"J\",'JP SC Raw Data'!$B:$B,\"2019/20\",'JP SC Raw Data'!$E:$E,\"National\")","v":33582},{"$f":"AE57/12","v":2798.5}]
[null,null,"Complaints called for first time ",1182,772,538,1734,1398,772,1485,1257,1564,1840,585,1536,1055,772,1657,2059,1929,2038,2143,2148,1932,1843,1261,2523,2135,{"$f":"SUM(AB58)","v":2135},null,{"$f":"SUMIFS('JP SC Raw Data'!$R:$R,'JP SC Raw Data'!$F:$F,\"J\",'JP SC Raw Data'!$B:$B,\"2019/20\",'JP SC Raw Data'!$E:$E,\"National\")","v":33066},{"$f":"AE58/12","v":2755.5}]
[null,null,"Complaints called for 'Continued Without Plea' hearing",994,936,900,1140,3278,3839,2986,2766,2521,2127,626,1482,1052,1743,3521,5126,3844,2783,2138,2060,1994,1698,1813,1607,1912,1912,null,{"$f":"SUMIFS('JP SC Raw Data'!$S:$S,'JP SC Raw Data'!$F:$F,\"J\",'JP SC Raw Data'!$B:$B,\"2019/20\",'JP SC Raw Data'!$E:$E,\"National\")","v":18263},1521.9166666666667]
[null,null,"Complaints called in Intermediate Diet court",700,446,106,365,1565,1838,1796,1504,1447,1774,931,847,658,683,1286,1480,1798,2006,1268,1683,1653,1926,1857,2111,1874,1874,null,{"$f":"SUMIFS('JP SC Raw Data'!$T:$T,'JP SC Raw Data'!$F:$F,\"J\",'JP SC Raw Data'!$B:$B,\"2019/20\",'JP SC Raw Data'!$E:$E,\"National\")","v":19195},{"$f":"AE60/12","v":1599.5833333333333}]
[null,null,"Trials called",126,71,7,23,308,698,658,738,653,860,111,276,102,50,240,495,952,875,725,638,878,681,882,1116,964,964,null,{"$f":"SUMIFS('JP SC Raw Data'!$U:$U,'JP SC Raw Data'!$F:$F,\"J\",'JP SC Raw Data'!$B:$B,\"2019/20\",'JP SC Raw Data'!$E:$E,\"National\")","v":10061},838.41666666666663]
[null,null,"Trials called where evidence was led",0,0,0,1,23,68,68,87,73,27,2,0,0,0,16,51,67,82,63,45,45,6,70,73,61,61,null,{"$f":"SUMIFS('JP SC Raw Data'!$V:$V,'JP SC Raw Data'!$F:$F,\"J\",'JP SC Raw Data'!$B:$B,\"2019/20\",'JP SC Raw Data'!$E:$E,\"National\")","v":1543},128.58333333333334]
[null,null,"Trials adjourned due to lack of court time",0,0,0,0,3,10,13,5,4,2,0,0,0,0,0,2,14,7,5,8,8,0,9,10,10,10,null,{"$f":"SUMIFS('JP SC Raw Data'!$W:$W,'JP SC Raw Data'!$F:$F,\"J\",'JP SC Raw Data'!$B:$B,\"2019/20\",'JP SC Raw Data'!$E:$E,\"National\")","v":238},19.833333333333332]
[null,null,"Percentage of trials adjourned due to lack of court time",{"$f":"IFERROR(SUM(D63/D61),0)","v":0},{"$f":"IFERROR(SUM(E63/E61),0)","v":0},0,0,9.74025974025974E-3,{"$f":"IFERROR(SUM(I63/I61),\"\")","v":1.4326647564469915E-2},{"$f":"IFERROR(SUM(J63/J61),\"\")","v":1.9756838905775075E-2},{"$f":"IFERROR(SUM(K63/K61),\"\")","v":6.7750677506775072E-3},6.1255742725880554E-3,{"$f":"IFERROR(SUM(M63/M61),\"\")","v":2.3255813953488372E-3},{"$f":"IFERROR(SUM(N63/N61),\"\")","v":0},0,0,{"$f":"IFERROR(SUM(Q63/Q61),\"\")","v":0},0,4.0404040404040404E-3,{"$f":"IFERROR(SUM(T63/T61),\"\")","v":1.4705882352941176E-2},8.0000000000000002E-3,6.8965517241379309E-3,1.2539184952978056E-2,9.1116173120728925E-3,{"$f":"IFERROR(SUM(Y63/Y61),\"\")","v":0},1.020408163265306E-2,{"$f":"IFERROR(SUM(AA63/AA61),\"\")","v":8.9605734767025085E-3},{"$f":"IFERROR(SUM(AB63/AB61),\"\")","v":1.0373443983402489E-2},{"$f":"IFERROR(SUM(AC63/AC61),\"\")","v":1.0373443983402489E-2},null,{"$f":"SUM(AE63/AE61)","v":2.3655700228605508E-2},2.3655700228605508E-2]
[null,null,"Complaints concluded",10,50,193,459,1389,1822,1651,1683,1624,627,135,332,206,315,2017,3032,2797,2498,2022,1921,1781,1513,1741,2215,2093,{"$f":"SUM(AB65)","v":2093},null,{"$f":"SUMIFS('JP SC Raw Data'!$Y:$Y,'JP SC Raw Data'!$F:$F,\"J\",'JP SC Raw Data'!$B:$B,\"2019/20\",'JP SC Raw Data'!$E:$E,\"National\")","v":30686},{"$f":"AE65/12","v":2557.1666666666665}]
[null,null,"Average time between pleading diet and evidence led trial, where evidence led trial occurred in the period shown (weeks)","N/A","N/A","N/A",36.29,34.076956521739127,37.386911764705879,36.722352941176474,41.482298850574708,37.755342465753422,37.104444444444439,54.93,"N/A","N/A","N/A",58.126250000000006,58.44862745098041,58.657164179104477,55.04036585365855,59.379206349206349,59.829000000000001,58.7836,59.024999999999999,56.40343,54.183010000000003,53.937539999999998,{"$f":"AB66","v":53.937539999999998},null,null,22]
[null,null,"Trials scheduled at end of period",3220,3495,3732,4088,4491,4837,5074,5189,5371,5213,5255,5560,5999,6321,6945,7730,7944,7890,7941,8053,7936,8101,7868,7569,7289,{"$f":"AB67","v":7289},null,{"$f":"SUMIFS('JP SC Raw Data'!$X:$X,'JP SC Raw Data'!$B:$B,'JP SC Raw Data'!$AD$2,'JP SC Raw Data'!$C:$C,'JP SC Raw Data'!$AE$2,'JP SC Raw Data'!$D:$D,\"1\")","v":3497},3497]
[null,null,"Forecast Scheduled Trials as at end of period3",{"$f":"3497+(0.3*D57)-'Internal analytics'!F41","v":4094.2},{"$f":"D68+(0.3*E57)-'Internal analytics'!G41","v":4364.2},{"$f":"E68+(0.3*F57)-'Internal analytics'!H41","v":4657.3},{"$f":"F68+(0.3*G57)-'Internal analytics'!I41","v":5193.2},{"$f":"G68+(0.3*H57)-'Internal analytics'!J41","v":5381.4},{"$f":"H68+(0.3*I57)-'Internal analytics'!K41","v":5293.2},{"$f":"I68+(0.3*J57)-'Internal analytics'!L41","v":5459.3},{"$f":"J68+(0.3*K57)-'Internal analytics'!M41","v":5418.6},{"$f":"K68+(0.3*L57)-'Internal analytics'!N41","v":5500.4000000000005},{"$f":"L68+(0.3*M57)-SUM('Internal analytics'!O41,'Internal analytics'!O44)","v":5769.1},{"$f":"M68+(0.3*N57)-SUM('Internal analytics'!P41,'Internal analytics'!P44)","v":6133.6},{"$f":"N68+(0.3*O57)-SUM('Internal analytics'!Q41,'Internal analytics'!Q44)","v":6741.6},{"$f":"O68+(0.3*P57)-SUM('Internal analytics'!R41,'Internal analytics'!R44,'Internal analytics'!R45)","v":7303.2000000000007},{"$f":"P68+(0.3*Q57)-SUM('Internal analytics'!S41,'Internal analytics'!S44,'Internal analytics'!S45)","v":7779.5000000000009},{"$f":"Q68+(0.3*R57)-SUM('Internal analytics'!T41,'Internal analytics'!T44,'Internal analytics'!T45)","v":8122.7000000000007},{"$f":"R68+(0.3*S57)-SUM('Internal analytics'!U41,'Internal analytics'!U44,'Internal analytics'!U45)","v":8112.8000000000011},{"$f":"T67","v":7944},{"$f":"U67","v":7890},7941,8053,7936,{"$f":"Y67","v":8101},{"$f":"Z67","v":7868},{"$f":"AA67","v":7569},{"$f":"AB67","v":7289}]
[null,"Notes\n1. These figures provide interim management information during the Coronavirus pandemic. Official Statistics with full commentary will be published by SCTS each quarter as normal. \n2. All figures for 2019/20 are monthly averages except for the rows showing Trials Scheduled, Forecast Scheduled Trials and Average time between pleading diet and evidence led trial where figures are as at the end of the period shown.\n3. Forecast Scheduled Trials is provided as a guide to show not just the cases with future trial diets (Scheduled Trials), but to also include cases in the system that are likley to have a trial diet fixed at some point. This is calculated by taking Trials Scheduled at the end of March 2020 then adding a percentage of the cases registered that are likely to have a trial diet fixed (use Trials Called as a percentage of registered cases) then deduct any cases that have concluded at trial."]

{"sheet":"National Overview Chart Data","index":3,"n_rows":68,"n_cols":28,"rows_kept":68,"cut":false,"hidden":true,"merged":[[67,0,69,0]]}
["National overview chart data"]
[]
["Cases Registered",{"$f":"'1a'!D3","v":"2020-04-01"},{"$f":"'1a'!E3","v":"2020-05-01"},{"$f":"'1a'!F3","v":"2020-06-01"},{"$f":"'1a'!G3","v":"2020-07-01"},{"$f":"'1a'!H3","v":"2020-08-01"},{"$f":"'1a'!I3","v":"2020-09-01"},{"$f":"'1a'!J3","v":"2020-10-01"},{"$f":"'1a'!K3","v":"2020-11-01"},{"$f":"'1a'!L3","v":"2020-12-01"},{"$f":"'1a'!M3","v":"2021-01-01"},{"$f":"'1a'!N3","v":"2021-02-01"},{"$f":"'1a'!O3","v":"2021-03-01"},{"$f":"'1a'!P3","v":"2021-04-01"},{"$f":"'1a'!Q3","v":"2021-05-01"},{"$f":"'1a'!R3","v":"2021-06-01"},{"$f":"'1a'!S3","v":"2021-07-01"},{"$f":"'1a'!T3","v":"2021-08-01"},{"$f":"'1a'!U3","v":"2021-09-01"},{"$f":"'1a'!V3","v":"2021-10-01"},{"$f":"'1a'!W3","v":"2021-11-01"},{"$f":"'1a'!X3","v":"2021-12-01"},{"$f":"'1a'!Y3","v":"2022-01-01"},{"$f":"'1a'!Z3","v":"2022-02-01"},{"$f":"'1a'!AA3","v":"2022-03-01"},{"$f":"'1a'!AB3","v":"2022-04-01"},"2019/20 monthly average","2020/21 YTD"]
["National",{"$f":"'1a'!D4","v":5306},{"$f":"'1a'!E4","v":4561},{"$f":"'1a'!F4","v":5720},{"$f":"'1a'!G4","v":8558},{"$f":"'1a'!H4","v":7643},{"$f":"'1a'!I4","v":7333},{"$f":"'1a'!J4","v":6903},{"$f":"'1a'!K4","v":6050},{"$f":"'1a'!L4","v":5858},{"$f":"'1a'!M4","v":5703},{"$f":"'1a'!N4","v":5465},{"$f":"'1a'!O4","v":7560},{"$f":"'1a'!P4","v":7505},{"$f":"'1a'!Q4","v":6909},{"$f":"'1a'!R4","v":7136},{"$f":"'1a'!S4","v":6743},{"$f":"'1a'!T4","v":7214},{"$f":"'1a'!U4","v":7124},{"$f":"'1a'!V4","v":7166},{"$f":"'1a'!W4","v":7399},{"$f":"'1a'!X4","v":7235},{"$f":"'1a'!Y4","v":6894},{"$f":"'1a'!Z4","v":6233},{"$f":"'1a'!AA4","v":8009},{"$f":"'1a'!AB4","v":6814},{"$f":"'1a'!AF4","v":8795.6666666666661}]
["High Court",{"$f":"'1a'!D17","v":77},{"$f":"'1a'!E17","v":85},{"$f":"'1a'!F17","v":69},{"$f":"'1a'!G17","v":63},{"$f":"'1a'!H17","v":46},{"$f":"'1a'!I17","v":68},{"$f":"'1a'!J17","v":60},{"$f":"'1a'!K17","v":32},{"$f":"'1a'!L17","v":48},{"$f":"'1a'!M17","v":65},{"$f":"'1a'!N17","v":64},{"$f":"'1a'!O17","v":90},{"$f":"'1a'!P17","v":55},{"$f":"'1a'!Q17","v":43},{"$f":"'1a'!R17","v":57},{"$f":"'1a'!S17","v":66},{"$f":"'1a'!T17","v":37},{"$f":"'1a'!U17","v":57},{"$f":"'1a'!V17","v":69},{"$f":"'1a'!W17","v":54},{"$f":"'1a'!X17","v":69},{"$f":"'1a'!Y17","v":68},{"$f":"'1a'!Z17","v":90},{"$f":"'1a'!AA17","v":80},{"$f":"'1a'!AB17","v":77},{"$f":"'1a'!AF17","v":85.333333333333329}]
["Sheriff Court - Solemn",{"$f":"'1a'!D31","v":219},{"$f":"'1a'!E31","v":319},{"$f":"'1a'!F31","v":355},{"$f":"'1a'!G31","v":467},{"$f":"'1a'!H31","v":496},{"$f":"'1a'!I31","v":494},{"$f":"'1a'!J31","v":492},{"$f":"'1a'!K31","v":414},{"$f":"'1a'!L31","v":428},{"$f":"'1a'!M31","v":379},{"$f":"'1a'!N31","v":378},{"$f":"'1a'!O31","v":410},{"$f":"'1a'!P31","v":441},{"$f":"'1a'!Q31","v":532},{"$f":"'1a'!R31","v":471},{"$f":"'1a'!S31","v":520},{"$f":"'1a'!T31","v":447},{"$f":"'1a'!U31","v":481},{"$f":"'1a'!V31","v":479},{"$f":"'1a'!W31","v":541},{"$f":"'1a'!X31","v":450},{"$f":"'1a'!Y31","v":425},{"$f":"'1a'!Z31","v":525},{"$f":"'1a'!AA31","v":447},{"$f":"'1a'!AB31","v":421},{"$f":"'1a'!AF30","v":815}]
["Sheriff Court - Summary",{"$f":"'1a'!D44","v":3016},{"$f":"'1a'!E44","v":3247},{"$f":"'1a'!F44","v":4309},{"$f":"'1a'!G44","v":6205},{"$f":"'1a'!H44","v":6037},{"$f":"'1a'!I44","v":5855},{"$f":"'1a'!J44","v":4634},{"$f":"'1a'!K44","v":4383},{"$f":"'1a'!L44","v":3956},{"$f":"'1a'!M44","v":3790},{"$f":"'1a'!N44","v":3678},{"$f":"'1a'!O44","v":5000},{"$f":"'1a'!P44","v":5017},{"$f":"'1a'!Q44","v":4603},{"$f":"'1a'!R44","v":4544},{"$f":"'1a'!S44","v":4440},{"$f":"'1a'!T44","v":4718},{"$f":"'1a'!U44","v":4453},{"$f":"'1a'!V44","v":4510},{"$f":"'1a'!W44","v":4770},{"$f":"'1a'!X44","v":4860},{"$f":"'1a'!Y44","v":4614},{"$f":"'1a'!Z44","v":4007},{"$f":"'1a'!AA44","v":4970},{"$f":"'1a'!AB44","v":4423},{"$f":"'1a'!AF44","v":5457.5}]
["Justice of the Peace Court - Summary",{"$f":"'1a'!D57","v":1994},{"$f":"'1a'!E57","v":910},{"$f":"'1a'!F57","v":987},{"$f":"'1a'!G57","v":1823},{"$f":"'1a'!H57","v":1064},{"$f":"'1a'!I57","v":916},{"$f":"'1a'!J57","v":1717},{"$f":"'1a'!K57","v":1221},{"$f":"'1a'!L57","v":1426},{"$f":"'1a'!M57","v":1469},{"$f":"'1a'!N57","v":1345},{"$f":"'1a'!O57","v":2060},{"$f":"'1a'!P57","v":1992},{"$f":"'1a'!Q57","v":1731},{"$f":"'1a'!R57","v":2064},{"$f":"'1a'!S57","v":1717},{"$f":"'1a'!T57","v":2012},{"$f":"'1a'!U57","v":2133},{"$f":"'1a'!V57","v":2108},{"$f":"'1a'!W57","v":2034},{"$f":"'1a'!X57","v":1856},{"$f":"'1a'!Y57","v":1787},{"$f":"'1a'!Z57","v":1611},{"$f":"'1a'!AA57","v":2512},{"$f":"'1a'!AB57","v":1893},{"$f":"'1a'!AF57","v":2798.5}]
[]
[]
["Trials Called",{"$f":"'1a'!D3","v":"2020-04-01"},{"$f":"'1a'!E3","v":"2020-05-01"},{"$f":"'1a'!F3","v":"2020-06-01"},{"$f":"'1a'!G3","v":"2020-07-01"},{"$f":"'1a'!H3","v":"2020-08-01"},{"$f":"'1a'!I3","v":"2020-09-01"},{"$f":"'1a'!J3","v":"2020-10-01"},{"$f":"'1a'!K3","v":"2020-11-01"},{"$f":"'1a'!L3","v":"2020-12-01"},{"$f":"'1a'!M3","v":"2021-01-01"},{"$f":"L3","v":"2021-02-01"},"2021-03-01","2021-04-01","2021-05-01","2021-06-01","2021-07-01",{"$f":"R3","v":"2021-08-01"},"2021-09-01",{"$f":"T3","v":"2021-10-01"},"2021-11-01",{"$f":"V3","v":"2021-12-01"},"2022-01-01",{"$f":"X3","v":"2022-02-01"},"2022-03-01",{"$f":"Z3","v":"2022-04-01"},"2019/20 monthly average","2020/21 YTD"]
["National",{"$f":"'1a'!D9","v":1019},{"$f":"'1a'!E9","v":476},{"$f":"'1a'!F9","v":192},{"$f":"'1a'!G9","v":355},{"$f":"'1a'!H9","v":2811},{"$f":"'1a'!I9","v":3950},{"$f":"'1a'!J9","v":3980},{"$f":"'1a'!K9","v":4386},{"$f":"'1a'!L9","v":3868},{"$f":"'1a'!M9","v":4882},{"$f":"'1a'!N9","v":1200},{"$f":"'1a'!O9","v":3101},{"$f":"'1a'!P9","v":3167},{"$f":"'1a'!Q9","v":3649},{"$f":"'1a'!R9","v":4577},{"$f":"'1a'!S9","v":5062},{"$f":"'1a'!T9","v":5917},{"$f":"'1a'!U9","v":6778},{"$f":"'1a'!V9","v":5449},{"$f":"'1a'!W9","v":4420},{"$f":"'1a'!X9","v":5882},{"$f":"'1a'!Y9","v":5648},{"$f":"'1a'!Z9","v":6472},{"$f":"'1a'!AA9","v":8276},{"$f":"'1a'!AB9","v":6556},{"$f":"'1a'!AF9","v":4562}]
["High Court",{"$f":"'1a'!D21","v":0},{"$f":"'1a'!E21","v":0},{"$f":"'1a'!F21","v":0},{"$f":"'1a'!G21","v":4},{"$f":"'1a'!H21","v":14},{"$f":"'1a'!I21","v":26},{"$f":"'1a'!J21","v":42},{"$f":"'1a'!K21","v":58},{"$f":"'1a'!L21","v":47},{"$f":"'1a'!M21","v":56},{"$f":"'1a'!N21","v":67},{"$f":"'1a'!O21","v":66},{"$f":"'1a'!P21","v":46},{"$f":"'1a'!Q21","v":60},{"$f":"'1a'!R21","v":67},{"$f":"'1a'!S21","v":58},{"$f":"'1a'!T21","v":74},{"$f":"'1a'!U21","v":64},{"$f":"'1a'!V21","v":65},{"$f":"'1a'!W21","v":81},{"$f":"'1a'!X21","v":38},{"$f":"'1a'!Y21","v":62},{"$f":"'1a'!Z21","v":64},{"$f":"'1a'!AA21","v":73},{"$f":"'1a'!AB21","v":73},{"$f":"'1a'!AF21","v":67.666666666666671}]
["Sheriff Court - Solemn",{"$f":"'1a'!D35","v":91},{"$f":"'1a'!E35","v":33},{"$f":"'1a'!F35","v":31},{"$f":"'1a'!G35","v":37},{"$f":"'1a'!H35","v":146},{"$f":"'1a'!I35","v":119},{"$f":"'1a'!J35","v":73},{"$f":"'1a'!K35","v":147},{"$f":"'1a'!L35","v":78},{"$f":"'1a'!M35","v":161},{"$f":"'1a'!N35","v":285},{"$f":"'1a'!O35","v":388},{"$f":"'1a'!P35","v":362},{"$f":"'1a'!Q35","v":368},{"$f":"'1a'!R35","v":383},{"$f":"'1a'!S35","v":340},{"$f":"'1a'!T35","v":392},{"$f":"'1a'!U35","v":396},{"$f":"'1a'!V35","v":393},{"$f":"'1a'!W35","v":273},{"$f":"'1a'!X35","v":263},{"$f":"'1a'!Y35","v":368},{"$f":"'1a'!Z35","v":433},{"$f":"'1a'!AA35","v":488},{"$f":"'1a'!AB35","v":425},{"$f":"'1a'!AF35","v":261.83333333333331}]
["Sheriff Court - Summary",{"$f":"'1a'!D48","v":802},{"$f":"'1a'!E48","v":372},{"$f":"'1a'!F48","v":154},{"$f":"'1a'!G48","v":291},{"$f":"'1a'!H48","v":2343},{"$f":"'1a'!I48","v":3107},{"$f":"'1a'!J48","v":3207},{"$f":"'1a'!K48","v":3443},{"$f":"'1a'!L48","v":3090},{"$f":"'1a'!M48","v":3805},{"$f":"'1a'!N48","v":737},{"$f":"'1a'!O48","v":2371},{"$f":"'1a'!P48","v":2657},{"$f":"'1a'!Q48","v":3171},{"$f":"'1a'!R48","v":3887},{"$f":"'1a'!S48","v":4169},{"$f":"'1a'!T48","v":4499},{"$f":"'1a'!U48","v":5443},{"$f":"'1a'!V48","v":4266},{"$f":"'1a'!W48","v":3428},{"$f":"'1a'!X48","v":4703},{"$f":"'1a'!Y48","v":4537},{"$f":"'1a'!Z48","v":5093},{"$f":"'1a'!AA48","v":6599},{"$f":"'1a'!AB48","v":5094},{"$f":"'1a'!AF48","v":3394.0833333333335}]
["Justice of the Peace Court - Summary",{"$f":"'1a'!D61","v":126},{"$f":"'1a'!E61","v":71},{"$f":"'1a'!F61","v":7},{"$f":"'1a'!G61","v":23},{"$f":"'1a'!H61","v":308},{"$f":"'1a'!I61","v":698},{"$f":"'1a'!J61","v":658},{"$f":"'1a'!K61","v":738},{"$f":"'1a'!L61","v":653},{"$f":"'1a'!M61","v":860},{"$f":"'1a'!N61","v":111},{"$f":"'1a'!O61","v":276},{"$f":"'1a'!P61","v":102},{"$f":"'1a'!Q61","v":50},{"$f":"'1a'!R61","v":240},{"$f":"'1a'!S61","v":495},{"$f":"'1a'!T61","v":952},{"$f":"'1a'!U61","v":875},{"$f":"'1a'!V61","v":725},{"$f":"'1a'!W61","v":638},{"$f":"'1a'!X61","v":878},{"$f":"'1a'!Y61","v":681},{"$f":"'1a'!Z61","v":882},{"$f":"'1a'!AA61","v":1116},{"$f":"'1a'!AB61","v":964},{"$f":"'1a'!AF61","v":838.41666666666663}]
[]
[]
["Trials called where evidence was led","2020-04-01","2020-05-01","2020-06-01","2020-07-01","2020-08-01","2020-09-01","2020-10-01","2020-11-01","2020-12-01","2021-01-01",{"$f":"L3","v":"2021-02-01"},"2021-03-01","2021-04-01","2021-05-01","2021-06-01","2021-07-01",{"$f":"R3","v":"2021-08-01"},"2021-09-01",{"$f":"T3","v":"2021-10-01"},"2021-11-01",{"$f":"V3","v":"2021-12-01"},"2022-01-01",{"$f":"X3","v":"2022-02-01"},"2022-03-01",{"$f":"Z3","v":"2022-04-01"},"2019/20 monthly average","2020/21 YTD"]
["National",{"$f":"'1a'!D10","v":5},{"$f":"'1a'!E10","v":9},{"$f":"'1a'!F10","v":24},{"$f":"'1a'!G10","v":84},{"$f":"'1a'!H10","v":320},{"$f":"'1a'!I10","v":526},{"$f":"'1a'!J10","v":575},{"$f":"'1a'!K10","v":627},{"$f":"'1a'!L10","v":512},{"$f":"'1a'!M10","v":276},{"$f":"'1a'!N10","v":186},{"$f":"'1a'!O10","v":401},{"$f":"'1a'!P10","v":470},{"$f":"'1a'!Q10","v":558},{"$f":"'1a'!R10","v":622},{"$f":"'1a'!S10","v":583},{"$f":"'1a'!T10","v":664},{"$f":"'1a'!U10","v":775},{"$f":"'1a'!V10","v":626},{"$f":"'1a'!W10","v":541},{"$f":"'1a'!X10","v":549},{"$f":"'1a'!Y10","v":536},{"$f":"'1a'!Z10","v":754},{"$f":"'1a'!AA10","v":827},{"$f":"'1a'!AB10","v":691},{"$f":"'1a'!AF10","v":843.41666666666663}]
["High Court",{"$f":"'1a'!D22","v":0},{"$f":"'1a'!E22","v":0},{"$f":"'1a'!F22","v":0},{"$f":"'1a'!G22","v":4},{"$f":"'1a'!H22","v":14},{"$f":"'1a'!I22","v":18},{"$f":"'1a'!J22","v":28},{"$f":"'1a'!K22","v":49},{"$f":"'1a'!L22","v":29},{"$f":"'1a'!M22","v":43},{"$f":"'1a'!N22","v":42},{"$f":"'1a'!O22","v":51},{"$f":"'1a'!P22","v":34},{"$f":"'1a'!Q22","v":43},{"$f":"'1a'!R22","v":47},{"$f":"'1a'!S22","v":48},{"$f":"'1a'!T22","v":55},{"$f":"'1a'!U22","v":47},{"$f":"'1a'!V22","v":54},{"$f":"'1a'!W22","v":63},{"$f":"'1a'!X22","v":30},{"$f":"'1a'!Y22","v":47},{"$f":"'1a'!Z22","v":54},{"$f":"'1a'!AA22","v":55},{"$f":"'1a'!AB22","v":50},{"$f":"'1a'!AF22","v":41.5}]
["Sheriff Court - Solemn",{"$f":"'1a'!D36","v":0},{"$f":"'1a'!E36","v":0},{"$f":"'1a'!F36","v":0},{"$f":"'1a'!G36","v":0},{"$f":"'1a'!H36","v":0},{"$f":"'1a'!I36","v":0},{"$f":"'1a'!J36","v":0},{"$f":"'1a'!K36","v":0},{"$f":"'1a'!L36","v":11},{"$f":"'1a'!M36","v":30},{"$f":"'1a'!N36","v":56},{"$f":"'1a'!O36","v":100},{"$f":"'1a'!P36","v":84},{"$f":"'1a'!Q36","v":82},{"$f":"'1a'!R36","v":88},{"$f":"'1a'!S36","v":76},{"$f":"'1a'!T36","v":83},{"$f":"'1a'!U36","v":95},{"$f":"'1a'!V36","v":70},{"$f":"'1a'!W36","v":48},{"$f":"'1a'!X36","v":52},{"$f":"'1a'!Y36","v":56},{"$f":"'1a'!Z36","v":78},{"$f":"'1a'!AA36","v":95},{"$f":"'1a'!AB36","v":75},{"$f":"'1a'!AF36","v":94.5}]
["Sheriff Court - Summary",{"$f":"'1a'!D49","v":5},{"$f":"'1a'!E49","v":9},{"$f":"'1a'!F49","v":24},{"$f":"'1a'!G49","v":79},{"$f":"'1a'!H49","v":283},{"$f":"'1a'!I49","v":440},{"$f":"'1a'!J49","v":479},{"$f":"'1a'!K49","v":491},{"$f":"'1a'!L49","v":399},{"$f":"'1a'!M49","v":176},{"$f":"'1a'!N49","v":86},{"$f":"'1a'!O49","v":250},{"$f":"'1a'!P49","v":352},{"$f":"'1a'!Q49","v":433},{"$f":"'1a'!R49","v":471},{"$f":"'1a'!S49","v":408},{"$f":"'1a'!T49","v":459},{"$f":"'1a'!U49","v":551},{"$f":"'1a'!V49","v":439},{"$f":"'1a'!W49","v":385},{"$f":"'1a'!X49","v":422},{"$f":"'1a'!Y49","v":427},{"$f":"'1a'!Z49","v":552},{"$f":"'1a'!AA49","v":604},{"$f":"'1a'!AB49","v":505},{"$f":"'1a'!AF49","v":578.83333333333337}]
["Justice of the Peace Court - Summary",{"$f":"'1a'!D62","v":0},{"$f":"'1a'!E62","v":0},{"$f":"'1a'!F62","v":0},{"$f":"'1a'!G62","v":1},{"$f":"'1a'!H62","v":23},{"$f":"'1a'!I62","v":68},{"$f":"'1a'!J62","v":68},{"$f":"'1a'!K62","v":87},{"$f":"'1a'!L62","v":73},{"$f":"'1a'!M62","v":27},{"$f":"'1a'!N62","v":2},{"$f":"'1a'!O62","v":0},{"$f":"'1a'!P62","v":0},{"$f":"'1a'!Q62","v":0},{"$f":"'1a'!R62","v":16},{"$f":"'1a'!S62","v":51},{"$f":"'1a'!T62","v":67},{"$f":"'1a'!U62","v":82},{"$f":"'1a'!V62","v":63},{"$f":"'1a'!W62","v":45},{"$f":"'1a'!X62","v":45},{"$f":"'1a'!Y62","v":6},{"$f":"'1a'!Z62","v":70},{"$f":"'1a'!AA62","v":73},{"$f":"'1a'!AB62","v":61},{"$f":"'1a'!AF62","v":128.58333333333334}]
[]
[]
["Cases concluded","2020-04-01","2020-05-01","2020-06-01","2020-07-01","2020-08-01","2020-09-01","2020-10-01","2020-11-01","2020-12-01","2021-01-01",{"$f":"L3","v":"2021-02-01"},"2021-03-01","2021-04-01","2021-05-01","2021-06-01","2021-07-01",{"$f":"R3","v":"2021-08-01"},"2021-09-01",{"$f":"T3","v":"2021-10-01"},"2021-11-01",{"$f":"V3","v":"2021-12-01"},"2022-01-01",{"$f":"X3","v":"2022-02-01"},"2022-03-01",{"$f":"Z3","v":"2022-04-01"},"2019/20 monthly average","2020/21 YTD"]
["National",{"$f":"'1a'!D13","v":586},{"$f":"'1a'!E13","v":930},{"$f":"'1a'!F13","v":1519},{"$f":"'1a'!G13","v":2892},{"$f":"'1a'!H13","v":5792},{"$f":"'1a'!I13","v":6959},{"$f":"'1a'!J13","v":6407},{"$f":"'1a'!K13","v":6257},{"$f":"'1a'!L13","v":5922},{"$f":"'1a'!M13","v":3070},{"$f":"'1a'!N13","v":2226},{"$f":"'1a'!O13","v":3599},{"$f":"'1a'!P13","v":4188},{"$f":"'1a'!Q13","v":4996},{"$f":"'1a'!R13","v":7085},{"$f":"'1a'!S13","v":7989},{"$f":"'1a'!T13","v":7978},{"$f":"'1a'!U13","v":8185},{"$f":"'1a'!V13","v":6594},{"$f":"'1a'!W13","v":6579},{"$f":"'1a'!X13","v":6610},{"$f":"'1a'!Y13","v":6041},{"$f":"'1a'!Z13","v":7220},{"$f":"'1a'!AA13","v":8682},{"$f":"'1a'!AB13","v":7621},{"$f":"'1a'!AF13","v":7825.25}]
["High Court",{"$f":"'1a'!D25","v":7},{"$f":"'1a'!E25","v":9},{"$f":"'1a'!F25","v":14},{"$f":"'1a'!G25","v":32},{"$f":"'1a'!H25","v":35},{"$f":"'1a'!I25","v":20},{"$f":"'1a'!J25","v":39},{"$f":"'1a'!K25","v":54},{"$f":"'1a'!L25","v":54},{"$f":"'1a'!M25","v":55},{"$f":"'1a'!N25","v":72},{"$f":"'1a'!O25","v":64},{"$f":"'1a'!P25","v":53},{"$f":"'1a'!Q25","v":58},{"$f":"'1a'!R25","v":62},{"$f":"'1a'!S25","v":58},{"$f":"'1a'!T25","v":76},{"$f":"'1a'!U25","v":62},{"$f":"'1a'!V25","v":70},{"$f":"'1a'!W25","v":82},{"$f":"'1a'!X25","v":56},{"$f":"'1a'!Y25","v":45},{"$f":"'1a'!Z25","v":57},{"$f":"'1a'!AA25","v":77},{"$f":"'1a'!AB25","v":66},{"$f":"'1a'!AF25","v":67.166666666666671}]
["Sheriff Court - Solemn",{"$f":"'1a'!D39","v":140},{"$f":"'1a'!E39","v":127},{"$f":"'1a'!F39","v":166},{"$f":"'1a'!G39","v":174},{"$f":"'1a'!H39","v":284},{"$f":"'1a'!I39","v":358},{"$f":"'1a'!J39","v":322},{"$f":"'1a'!K39","v":276},{"$f":"'1a'!L39","v":300},{"$f":"'1a'!M39","v":317},{"$f":"'1a'!N39","v":354},{"$f":"'1a'!O39","v":468},{"$f":"'1a'!P39","v":463},{"$f":"'1a'!Q39","v":442},{"$f":"'1a'!R39","v":459},{"$f":"'1a'!S39","v":453},{"$f":"'1a'!T39","v":451},{"$f":"'1a'!U39","v":439},{"$f":"'1a'!V39","v":403},{"$f":"'1a'!W39","v":414},{"$f":"'1a'!X39","v":363},{"$f":"'1a'!Y39","v":357},{"$f":"'1a'!Z39","v":427},{"$f":"'1a'!AA39","v":461},{"$f":"'1a'!AB39","v":475},{"$f":"'1a'!AF39","v":429.58333333333331}]
["Sheriff Court - Summary",{"$f":"'1a'!D52","v":429},{"$f":"'1a'!E52","v":744},{"$f":"'1a'!F52","v":1146},{"$f":"'1a'!G52","v":2227},{"$f":"'1a'!H52","v":4084},{"$f":"'1a'!I52","v":4759},{"$f":"'1a'!J52","v":4395},{"$f":"'1a'!K52","v":4244},{"$f":"'1a'!L52","v":3944},{"$f":"'1a'!M52","v":2071},{"$f":"'1a'!N52","v":1665},{"$f":"'1a'!O52","v":2735},{"$f":"'1a'!P52","v":3466},{"$f":"'1a'!Q52","v":4181},{"$f":"'1a'!R52","v":4547},{"$f":"'1a'!S52","v":4446},{"$f":"'1a'!T52","v":4654},{"$f":"'1a'!U52","v":5186},{"$f":"'1a'!V52","v":4099},{"$f":"'1a'!W52","v":4162},{"$f":"'1a'!X52","v":4410},{"$f":"'1a'!Y52","v":4126},{"$f":"'1a'!Z52","v":4995},{"$f":"'1a'!AA52","v":5929},{"$f":"'1a'!AB52","v":4987},{"$f":"'1a'!AF52","v":4771.333333333333}]
["Justice of the Peace Court - Summary",{"$f":"'1a'!D65","v":10},{"$f":"'1a'!E65","v":50},{"$f":"'1a'!F65","v":193},{"$f":"'1a'!G65","v":459},{"$f":"'1a'!H65","v":1389},{"$f":"'1a'!I65","v":1822},{"$f":"'1a'!J65","v":1651},{"$f":"'1a'!K65","v":1683},{"$f":"'1a'!L65","v":1624},{"$f":"'1a'!M65","v":627},{"$f":"'1a'!N65","v":135},{"$f":"'1a'!O65","v":332},{"$f":"'1a'!P65","v":206},{"$f":"'1a'!Q65","v":315},{"$f":"'1a'!R65","v":2017},{"$f":"'1a'!S65","v":3032},{"$f":"'1a'!T65","v":2797},{"$f":"'1a'!U65","v":2498},{"$f":"'1a'!V65","v":2022},{"$f":"'1a'!W65","v":1921},{"$f":"'1a'!X65","v":1781},{"$f":"'1a'!Y65","v":1513},{"$f":"'1a'!Z65","v":1741},{"$f":"'1a'!AA65","v":2215},{"$f":"'1a'!AB65","v":2093},{"$f":"'1a'!AF65","v":2557.1666666666665}]
[]
[]
["Trial delay - average time between pleading diet and evidence led trial, where evidence led trial occurred in the period shown (weeks)","2020-04-01","2020-05-01","2020-06-01","2020-07-01","2020-08-01","2020-09-01","2020-10-01","2020-11-01","2020-12-01","2021-01-01","2021-02-01","2021-03-01","2021-04-01","2021-05-01","2021-06-01","2021-07-01","2021-08-01","2021-09-01","2021-10-01","2021-11-01","2021-12-01","2022-01-01","2022-02-01","2022-03-01","2022-04-01"]
["High Court",{"$f":"'1a'!D26","v":20},{"$f":"'1a'!E26","v":"N/A"},{"$f":"'1a'!F26","v":"N/A"},{"$f":"'1a'!G26","v":21},{"$f":"'1a'!H26","v":34},{"$f":"'1a'!I26","v":35},{"$f":"'1a'!J26","v":50},{"$f":"'1a'!K26","v":52},{"$f":"'1a'!L26","v":54},{"$f":"'1a'!M26","v":52},{"$f":"'1a'!N26","v":54},{"$f":"'1a'!O26","v":66},{"$f":"'1a'!P26","v":58},{"$f":"'1a'!Q26","v":51},{"$f":"'1a'!R26","v":50},{"$f":"'1a'!S26","v":55},{"$f":"'1a'!T26","v":51},{"$f":"'1a'!U26","v":54},{"$f":"'1a'!V26","v":50},{"$f":"'1a'!W26","v":50.993333300000003},{"$f":"'1a'!X26","v":57},{"$f":"'1a'!Y26","v":62},{"$f":"'1a'!Z26","v":48},{"$f":"'1a'!AA26","v":48},{"$f":"'1a'!AB26","v":49}]
["Sheriff Court - Solemn",{"$f":"'1a'!D40","v":"N/A"},{"$f":"'1a'!E40","v":"N/A"},{"$f":"'1a'!F40","v":"N/A"},{"$f":"'1a'!G40","v":"N/A"},{"$f":"'1a'!H40","v":"N/A"},{"$f":"'1a'!I40","v":"N/A"},{"$f":"'1a'!J40","v":"N/A"},{"$f":"'1a'!K40","v":"N/A"},{"$f":"'1a'!L40","v":29.975454545454546},{"$f":"'1a'!M40","v":32.182999999999993},{"$f":"'1a'!N40","v":35.683749999999996},{"$f":"'1a'!O40","v":37},{"$f":"'1a'!P40","v":38.311309523809513},{"$f":"'1a'!Q40","v":43.999390243902425},{"$f":"'1a'!R40","v":41.658181818181816},{"$f":"'1a'!S40","v":41.361184210526318},{"$f":"'1a'!T40","v":44.76650602409638},{"$f":"'1a'!U40","v":42.948947368421059},{"$f":"'1a'!V40","v":41.784857142857149},{"$f":"'1a'!W40","v":48.342916670000001},{"$f":"'1a'!X40","v":41},{"$f":"'1a'!Y40","v":40.6616071428571},{"$f":"'1a'!Z40","v":44.063209999999998},{"$f":"'1a'!AA40","v":45.251368421052597},{"$f":"'1a'!AB40","v":40.514270000000003}]
["Sheriff Court - Summary",{"$f":"'1a'!D53","v":7.0840000000000005},{"$f":"'1a'!E53","v":3.8433333333333337},{"$f":"'1a'!F53","v":11.475000000000001},{"$f":"'1a'!G53","v":21.380506329113924},{"$f":"'1a'!H53","v":34.065795053003527},{"$f":"'1a'!I53","v":37.83834090909091},{"$f":"'1a'!J53","v":35.172505219206677},{"$f":"'1a'!K53","v":33.833217922606913},{"$f":"'1a'!L53","v":34.112481203007512},{"$f":"'1a'!M53","v":36.059147727272737},{"$f":"'1a'!N53","v":35.496279069767454},{"$f":"'1a'!O53","v":34.892799999999994},{"$f":"'1a'!P53","v":34.803607954545448},{"$f":"'1a'!Q53","v":36.660762124711319},{"$f":"'1a'!R53","v":41.735180467091311},{"$f":"'1a'!S53","v":44.970416666666679},{"$f":"'1a'!T53","v":45.601045751633997},{"$f":"'1a'!U53","v":48.230235934664236},{"$f":"'1a'!V53","v":47.259476082004547},{"$f":"'1a'!W53","v":45.570300000000003},{"$f":"'1a'!X53","v":46.966099999999997},{"$f":"'1a'!Y53","v":49.673279999999998},{"$f":"'1a'!Z53","v":52.493639999999999},{"$f":"'1a'!AA53","v":50.456589403973503},{"$f":"'1a'!AB53","v":52.718000000000004}]
["Justice of the Peace Court - Summary",{"$f":"'1a'!D66","v":"N/A"},{"$f":"'1a'!E66","v":"N/A"},{"$f":"'1a'!F66","v":"N/A"},{"$f":"'1a'!G66","v":36.29},{"$f":"'1a'!H66","v":34.076956521739127},{"$f":"'1a'!I66","v":37.386911764705879},{"$f":"'1a'!J66","v":36.722352941176474},{"$f":"'1a'!K66","v":41.482298850574708},{"$f":"'1a'!L66","v":37.755342465753422},{"$f":"'1a'!M66","v":37.104444444444439},{"$f":"'1a'!N66","v":54.93},{"$f":"'1a'!O66","v":"N/A"},{"$f":"'1a'!P66","v":"N/A"},{"$f":"'1a'!Q66","v":"N/A"},{"$f":"'1a'!R66","v":58.126250000000006},{"$f":"'1a'!S66","v":58.44862745098041},{"$f":"'1a'!T66","v":58.657164179104477},{"$f":"'1a'!U66","v":55.04036585365855},{"$f":"'1a'!V66","v":59.379206349206349},{"$f":"'1a'!W66","v":59.829000000000001},{"$f":"'1a'!X66","v":58.7836},{"$f":"'1a'!Y66","v":59.024999999999999},{"$f":"'1a'!Z66","v":56.40343},{"$f":"'1a'!AA66","v":54.183010000000003},{"$f":"'1a'!AB66","v":53.937539999999998}]
["High Court (as at end of 2019/20)",{"$f":"'1a'!$AF$26","v":22.1},{"$f":"'1a'!$AF$26","v":22.1},{"$f":"'1a'!$AF$26","v":22.1},{"$f":"'1a'!$AF$26","v":22.1},{"$f":"'1a'!$AF$26","v":22.1},{"$f":"'1a'!$AF$26","v":22.1},{"$f":"'1a'!$AF$26","v":22.1},{"$f":"'1a'!$AF$26","v":22.1},{"$f":"'1a'!$AF$26","v":22.1},{"$f":"'1a'!$AF$26","v":22.1},{"$f":"'1a'!$AF$26","v":22.1},{"$f":"'1a'!$AF$26","v":22.1},{"$f":"'1a'!$AF$26","v":22.1},{"$f":"'1a'!$AF$26","v":22.1},{"$f":"'1a'!$AF$26","v":22.1},{"$f":"'1a'!$AF$26","v":22.1},{"$f":"'1a'!$AF$26","v":22.1},{"$f":"'1a'!$AF$26","v":22.1},{"$f":"'1a'!$AF$26","v":22.1},{"$f":"'1a'!$AF$26","v":22.1},{"$f":"'1a'!$AF$26","v":22.1},{"$f":"'1a'!$AF$26","v":22.1},{"$f":"'1a'!$AF$26","v":22.1},{"$f":"'1a'!$AF$26","v":22.1},{"$f":"'1a'!$AF$26","v":22.1}]
["Sheriff Court - Solemn (as at end of 2019/20)",{"$f":"'1a'!$AF$40","v":11},{"$f":"'1a'!$AF$40","v":11},{"$f":"'1a'!$AF$40","v":11},{"$f":"'1a'!$AF$40","v":11},{"$f":"'1a'!$AF$40","v":11},{"$f":"'1a'!$AF$40","v":11},{"$f":"'1a'!$AF$40","v":11},{"$f":"'1a'!$AF$40","v":11},{"$f":"'1a'!$AF$40","v":11},{"$f":"'1a'!$AF$40","v":11},{"$f":"'1a'!$AF$40","v":11},{"$f":"'1a'!$AF$40","v":11},{"$f":"'1a'!$AF$40","v":11},{"$f":"'1a'!$AF$40","v":11},{"$f":"'1a'!$AF$40","v":11},{"$f":"'1a'!$AF$40","v":11},{"$f":"'1a'!$AF$40","v":11},{"$f":"'1a'!$AF$40","v":11},{"$f":"'1a'!$AF$40","v":11},{"$f":"'1a'!$AF$40","v":11},{"$f":"'1a'!$AF$40","v":11},{"$f":"'1a'!$AF$40","v":11},{"$f":"'1a'!$AF$40","v":11},{"$f":"'1a'!$AF$40","v":11},{"$f":"'1a'!$AF$40","v":11}]
["Sheriff Court - Summary (as at end of 2019/20)",{"$f":"'1a'!$AF$53","v":23},{"$f":"'1a'!$AF$53","v":23},{"$f":"'1a'!$AF$53","v":23},{"$f":"'1a'!$AF$53","v":23},{"$f":"'1a'!$AF$53","v":23},{"$f":"'1a'!$AF$53","v":23},{"$f":"'1a'!$AF$53","v":23},{"$f":"'1a'!$AF$53","v":23},{"$f":"'1a'!$AF$53","v":23},{"$f":"'1a'!$AF$53","v":23},{"$f":"'1a'!$AF$53","v":23},{"$f":"'1a'!$AF$53","v":23},{"$f":"'1a'!$AF$53","v":23},{"$f":"'1a'!$AF$53","v":23},{"$f":"'1a'!$AF$53","v":23},{"$f":"'1a'!$AF$53","v":23},{"$f":"'1a'!$AF$53","v":23},{"$f":"'1a'!$AF$53","v":23},{"$f":"'1a'!$AF$53","v":23},{"$f":"'1a'!$AF$53","v":23},{"$f":"'1a'!$AF$53","v":23},{"$f":"'1a'!$AF$53","v":23},{"$f":"'1a'!$AF$53","v":23},{"$f":"'1a'!$AF$53","v":23},{"$f":"'1a'!$AF$53","v":23}]
["Justice of the Peace Court - Summary (as at end of 2019/20)",{"$f":"'1a'!$AF$66","v":22},{"$f":"'1a'!$AF$66","v":22},{"$f":"'1a'!$AF$66","v":22},{"$f":"'1a'!$AF$66","v":22},{"$f":"'1a'!$AF$66","v":22},{"$f":"'1a'!$AF$66","v":22},{"$f":"'1a'!$AF$66","v":22},{"$f":"'1a'!$AF$66","v":22},{"$f":"'1a'!$AF$66","v":22},{"$f":"'1a'!$AF$66","v":22},{"$f":"'1a'!$AF$66","v":22},{"$f":"'1a'!$AF$66","v":22},{"$f":"'1a'!$AF$66","v":22},{"$f":"'1a'!$AF$66","v":22},{"$f":"'1a'!$AF$66","v":22},{"$f":"'1a'!$AF$66","v":22},{"$f":"'1a'!$AF$66","v":22},{"$f":"'1a'!$AF$66","v":22},{"$f":"'1a'!$AF$66","v":22},{"$f":"'1a'!$AF$66","v":22},{"$f":"'1a'!$AF$66","v":22},{"$f":"'1a'!$AF$66","v":22},{"$f":"'1a'!$AF$66","v":22},{"$f":"'1a'!$AF$66","v":22},{"$f":"'1a'!$AF$66","v":22}]
[]
[]
[]
["Scheduled trials","as at end of 2019/20","2020-04-01","2020-05-01","2020-06-01","2020-07-01","2020-08-01","2020-09-01","2020-10-01","2020-11-01","2020-12-01",{"$f":"K27","v":"2021-01-01"},{"$f":"L27","v":"2021-02-01"},{"$f":"M27","v":"2021-03-01"},{"$f":"N3","v":"2021-04-01"},"2021-05-01","2021-06-01","2021-07-01","2021-08-01",{"$f":"S3","v":"2021-09-01"},"2021-10-01","2021-11-01","2021-12-01","2022-01-01",{"$f":"X3","v":"2022-02-01"},{"$f":"Y3","v":"2022-03-01"},{"$f":"Z3","v":"2022-04-01"},"2020/21 YTD"]
["National",{"$f":"'1a'!AF14","v":18355},{"$f":"'1a'!D14","v":18074},{"$f":"'1a'!E14","v":20236},{"$f":"'1a'!F14","v":22437},{"$f":"'1a'!G14","v":25900},{"$f":"'1a'!H14","v":28351},{"$f":"'1a'!I14","v":30956},{"$f":"'1a'!J14","v":32427},{"$f":"'1a'!K14","v":33590},{"$f":"'1a'!L14","v":34283},{"$f":"'1a'!M14","v":35067},{"$f":"'1a'!N14","v":36037},{"$f":"'1a'!O14","v":37801},{"$f":"'1a'!P14","v":39488},{"$f":"'1a'!Q14","v":40882},{"$f":"'1a'!R14","v":42451},{"$f":"'1a'!S14","v":43341},{"$f":"'1a'!T14","v":43526},{"$f":"'1a'!U14","v":42554},{"$f":"'1a'!V14","v":42796},{"$f":"'1a'!W14","v":43597},{"$f":"'1a'!X14","v":43016},{"$f":"'1a'!Y14","v":43606},{"$f":"'1a'!Z14","v":42503},{"$f":"'1a'!AA14","v":40923},{"$f":"'1a'!AB14","v":39958}]
["National forecast",null,{"$f":"'1a'!D15","v":20942.420000000002},{"$f":"'1a'!E15","v":23435.710000000003},{"$f":"'1a'!F15","v":26586.52},{"$f":"'1a'!G15","v":31070.46},{"$f":"'1a'!H15","v":34091.429999999993},{"$f":"'1a'!I15","v":36273.239999999991},{"$f":"'1a'!J15","v":37857.419999999991},{"$f":"'1a'!K15","v":38816.789999999994},{"$f":"'1a'!L15","v":39973.1},{"$f":"'1a'!M15","v":41720.509999999995},{"$f":"'1a'!N15","v":43642.119999999995},{"$f":"'1a'!O15","v":45935.259999999995},{"$f":"'1a'!P15","v":47211.58},{"$f":"'1a'!Q15","v":47705.02},{"$f":"'1a'!R15","v":47567.41},{"$f":"'1a'!S15","v":47018.86},{"$f":"'1a'!T15","v":46078.609999999993},{"$f":"'1a'!U15","v":44530.52},{"$f":"'1a'!V15","v":44335.409999999996},{"$f":"'1a'!W15","v":45105.82},{"$f":"'1a'!X15","v":44518.2},{"$f":"'1a'!Y15","v":45111.81},{"$f":"'1a'!Z15","v":44090.01},{"$f":"'1a'!AA15","v":42382.38},{"$f":"'1a'!AB15","v":41382.44}]
["High Court",{"$f":"'1a'!AF27","v":390},{"$f":"'1a'!D27","v":390},{"$f":"'1a'!E27","v":390},{"$f":"'1a'!F27","v":390},{"$f":"'1a'!G27","v":386},{"$f":"'1a'!H27","v":375},{"$f":"'1a'!I27","v":360},{"$f":"'1a'!J27","v":335},{"$f":"'1a'!K27","v":291},{"$f":"'1a'!L27","v":250},{"$f":"'1a'!M27","v":215},{"$f":"'1a'!N27","v":247},{"$f":"'1a'!O27","v":267},{"$f":"'1a'!P27","v":292},{"$f":"'1a'!Q27","v":304},{"$f":"'1a'!R27","v":313},{"$f":"'1a'!S27","v":325},{"$f":"'1a'!T27","v":432},{"$f":"'1a'!U27","v":389},{"$f":"'1a'!V27","v":444},{"$f":"'1a'!W27","v":476},{"$f":"'1a'!X27","v":516},{"$f":"'1a'!Y27","v":534},{"$f":"'1a'!Z27","v":535},{"$f":"'1a'!AA27","v":560},{"$f":"'1a'!AB27","v":609}]
["High Court forecast",null,{"$f":"'1a'!D28","v":451.6},{"$f":"'1a'!E28","v":519.6},{"$f":"'1a'!F28","v":574.80000000000007},{"$f":"'1a'!G28","v":621.20000000000005},{"$f":"'1a'!H28","v":647},{"$f":"'1a'!I28","v":686.4},{"$f":"'1a'!J28","v":709.4},{"$f":"'1a'!K28","v":715},{"$f":"'1a'!L28","v":724},{"$f":"'1a'!M28","v":741},{"$f":"'1a'!N28","v":745.2},{"$f":"'1a'!O28","v":773.2},{"$f":"'1a'!P28","v":781.2},{"$f":"'1a'!Q28","v":785.6},{"$f":"'1a'!R28","v":784.2},{"$f":"'1a'!S28","v":787},{"$f":"'1a'!T28","v":763.6},{"$f":"'1a'!U28","v":762.2},{"$f":"'1a'!V28","v":760.40000000000009},{"$f":"'1a'!W28","v":750.60000000000014},{"$f":"'1a'!X28","v":759.80000000000018},{"$f":"'1a'!Y28","v":780.20000000000016},{"$f":"'1a'!Z28","v":802.20000000000016},{"$f":"'1a'!AA28","v":802.20000000000016},{"$f":"'1a'!AB28","v":815.80000000000018}]
["Sheriff Court - Solemn",{"$f":"'1a'!AF41","v":497},{"$f":"'1a'!D41","v":497},{"$f":"'1a'!E41","v":497},{"$f":"'1a'!F41","v":497},{"$f":"'1a'!G41","v":497},{"$f":"'1a'!H41","v":553},{"$f":"'1a'!I41","v":613},{"$f":"'1a'!J41","v":648},{"$f":"'1a'!K41","v":738},{"$f":"'1a'!L41","v":939},{"$f":"'1a'!M41","v":1091},{"$f":"'1a'!N41","v":1211},{"$f":"'1a'!O41","v":1329},{"$f":"'1a'!P41","v":1398},{"$f":"'1a'!Q41","v":1479},{"$f":"'1a'!R41","v":1595},{"$f":"'1a'!S41","v":1684},{"$f":"'1a'!T41","v":1781},{"$f":"'1a'!U41","v":1842},{"$f":"'1a'!V41","v":1923},{"$f":"'1a'!W41","v":2053},{"$f":"'1a'!X41","v":2170},{"$f":"'1a'!Y41","v":2212},{"$f":"'1a'!Z41","v":2196},{"$f":"'1a'!AA41","v":2274},{"$f":"'1a'!AB41","v":2267}]
["Sheriff Court - Solemn forecast",null,{"$f":"'1a'!D42","v":588.70000000000005},{"$f":"'1a'!E42","v":764.85},{"$f":"'1a'!F42","v":957.78},{"$f":"'1a'!G42","v":1216.32},{"$f":"'1a'!H42","v":1479.35},{"$f":"'1a'!I42","v":1736.86},{"$f":"'1a'!J42","v":2000.86},{"$f":"'1a'!K42","v":2211.87},{"$f":"'1a'!L42","v":2435.66},{"$f":"'1a'!M42","v":2591.5699999999997},{"$f":"'1a'!N42","v":2644.12},{"$f":"'1a'!O42","v":2669.2599999999998},{"$f":"'1a'!P42","v":2720.4399999999996},{"$f":"'1a'!Q42","v":2830.3199999999997},{"$f":"'1a'!R42","v":2869.6299999999997},{"$f":"'1a'!S42","v":2974.3799999999997},{"$f":"'1a'!T42","v":3008.1699999999996},{"$f":"'1a'!U42","v":3057.6199999999994},{"$f":"'1a'!V42","v":3146.0099999999993},{"$f":"'1a'!W42","v":3287.2199999999993},{"$f":"'1a'!X42","v":3428.3999999999992},{"$f":"'1a'!Y42","v":3471.6099999999992},{"$f":"'1a'!Z42","v":3515.809999999999},{"$f":"'1a'!AA42","v":3491.1799999999989},{"$f":"'1a'!AB42","v":3484.639999999999}]
["Sheriff Court - Summary",{"$f":"'1a'!AF54","v":13971},{"$f":"'1a'!D54","v":13967},{"$f":"'1a'!E54","v":15854},{"$f":"'1a'!F54","v":17818},{"$f":"'1a'!G54","v":20929},{"$f":"'1a'!H54","v":22932},{"$f":"'1a'!I54","v":25146},{"$f":"'1a'!J54","v":26370},{"$f":"'1a'!K54","v":27372},{"$f":"'1a'!L54","v":27723},{"$f":"'1a'!M54","v":28548},{"$f":"'1a'!N54","v":29324},{"$f":"'1a'!O54","v":30645},{"$f":"'1a'!P54","v":31799},{"$f":"'1a'!Q54","v":32778},{"$f":"'1a'!R54","v":33598},{"$f":"'1a'!S54","v":33602},{"$f":"'1a'!T54","v":33369},{"$f":"'1a'!U54","v":32433},{"$f":"'1a'!V54","v":32488},{"$f":"'1a'!W54","v":33015},{"$f":"'1a'!X54","v":32394},{"$f":"'1a'!Y54","v":32759},{"$f":"'1a'!Z54","v":31904},{"$f":"'1a'!AA54","v":30520},{"$f":"'1a'!AB54","v":29793}]
["Sheriff Court - Summary forecast",null,{"$f":"'1a'!D55","v":15807.92},{"$f":"'1a'!E55","v":17787.060000000001},{"$f":"'1a'!F55","v":20396.64},{"$f":"'1a'!G55","v":24039.739999999998},{"$f":"'1a'!H55","v":26583.679999999997},{"$f":"'1a'!I55","v":28556.779999999995},{"$f":"'1a'!J55","v":29687.859999999993},{"$f":"'1a'!K55","v":30471.319999999992},{"$f":"'1a'!L55","v":31313.039999999994},{"$f":"'1a'!M55","v":32618.839999999997},{"$f":"'1a'!N55","v":34119.199999999997},{"$f":"'1a'!O55","v":35751.199999999997},{"$f":"'1a'!P55","v":36406.74},{"$f":"'1a'!Q55","v":36309.599999999999},{"$f":"'1a'!R55","v":35790.879999999997},{"$f":"'1a'!S55","v":35144.68},{"$f":"'1a'!T55","v":34362.839999999997},{"$f":"'1a'!U55","v":32820.699999999997},{"$f":"'1a'!V55","v":32488},{"$f":"'1a'!W55","v":33015},{"$f":"'1a'!X55","v":32394},{"$f":"'1a'!Y55","v":32759},{"$f":"'1a'!Z55","v":31904},{"$f":"'1a'!AA55","v":30520},{"$f":"'1a'!AB55","v":29793}]
["Justice of the Peace Court - Summary",{"$f":"'1a'!AF67","v":3497},{"$f":"'1a'!D67","v":3220},{"$f":"'1a'!E67","v":3495},{"$f":"'1a'!F67","v":3732},{"$f":"'1a'!G67","v":4088},{"$f":"'1a'!H67","v":4491},{"$f":"'1a'!I67","v":4837},{"$f":"'1a'!J67","v":5074},{"$f":"'1a'!K67","v":5189},{"$f":"'1a'!L67","v":5371},{"$f":"'1a'!M67","v":5213},{"$f":"'1a'!N67","v":5255},{"$f":"'1a'!O67","v":5560},{"$f":"'1a'!P67","v":5999},{"$f":"'1a'!Q67","v":6321},{"$f":"'1a'!R67","v":6945},{"$f":"'1a'!S67","v":7730},{"$f":"'1a'!T67","v":7944},{"$f":"'1a'!U67","v":7890},{"$f":"'1a'!V67","v":7941},{"$f":"'1a'!W67","v":8053},{"$f":"'1a'!X67","v":7936},{"$f":"'1a'!Y67","v":8101},{"$f":"'1a'!Z67","v":7868},{"$f":"'1a'!AA67","v":7569},{"$f":"'1a'!AB67","v":7289}]
["Justice of the Peace Court - Summary forecast",null,{"$f":"'1a'!D68","v":4094.2},{"$f":"'1a'!E68","v":4364.2},{"$f":"'1a'!F68","v":4657.3},{"$f":"'1a'!G68","v":5193.2},{"$f":"'1a'!H68","v":5381.4},{"$f":"'1a'!I68","v":5293.2},{"$f":"'1a'!J68","v":5459.3},{"$f":"'1a'!K68","v":5418.6},{"$f":"'1a'!L68","v":5500.4000000000005},{"$f":"'1a'!M68","v":5769.1},{"$f":"'1a'!N68","v":6133.6},{"$f":"'1a'!O68","v":6741.6},{"$f":"'1a'!P68","v":7303.2000000000007},{"$f":"'1a'!Q68","v":7779.5000000000009},{"$f":"'1a'!R68","v":8122.7000000000007},{"$f":"'1a'!S68","v":8112.8000000000011},{"$f":"'1a'!T68","v":7944},{"$f":"'1a'!U68","v":7890},{"$f":"'1a'!V68","v":7941},{"$f":"'1a'!W68","v":8053},{"$f":"'1a'!X68","v":7936},{"$f":"'1a'!Y68","v":8101},{"$f":"'1a'!Z68","v":7868},{"$f":"'1a'!AA68","v":7569},{"$f":"'1a'!AB68","v":7289}]
[]
[]
[]
[]
[]
[]
[]
[]
[]
[]
["This data is only for The Scottish Courts and Tribunals Service Internal use. Please go to the index tab and navigate as required."]

{"sheet":"1b","index":4,"n_rows":63,"n_cols":4,"rows_kept":63,"cut":false,"hidden":false,"merged":[[63,3,63,14],[25,28,25,39]]}
[]
[null,"Back to Index"]
[]
[]
[]
[]
[]
[]
[]
[]
[]
[]
[]
[]
[]
[]
[]
[]
[]
[]
[]
[]
[]
[]
[]
[]
[]
[]
[]
[]
[]
[]
[]
[]
[]
[]
[]
[]
[]
[]
[]
[]
[]
[]
[]
[]
[]
[]
[]
[]
[]
[]
[]
[]
[]
[]
[]
[]
[]
[]
[]
[]
[null,null,null,"Notes:"]

{"sheet":"High Court Raw Data","index":5,"n_rows":7,"n_cols":23,"rows_kept":7,"cut":false,"hidden":true,"merged":[]}
["This data is only for The Scottish Courts and Tribunals Service Internal use. Please go to the index tab and navigate as required."]
["FINANCIAL_YEAR","QUARTER","COURT_REF","COURT_NAME","INDICTMENTS_REG","INDICTMENTS_PH","INDICTMENTS_CALLED_CPH","S76_INDICTMENTS","TRIALS_CALLED","TRIALS_ELED","TRIALS_LOCT","TRIALS_OUTSTANDING","SOL_CASES_FULLY_DISPOSED",null,null,"Current Year","Current Quarter"]
["2019/20","Q1",2,"HIGH CT",248,253,100,25,168,107,5,315,182,null,null,{"$f":"LOOKUP(2,1/($A:$A<>\"\"),$A:$A)","v":"2020/21"},{"$f":"LOOKUP(2,1/($B:$B<>\"\"),$B:$B)","v":"Q1"},null,"2019/20","Q4",null,"2018/19","Q4"]
["2019/20","Q2",2,"HIGH CT",272,241,114,22,219,146,4,304,241]
["2019/20","Q3",2,"HIGH CT",274,267,115,24,190,120,22,369,206]
["2019/20","Q4",2,"HIGH CT",230,220,108,23,235,125,18,390,177]
["2020/21","Q1",2,"HIGH CT",231,92,40,17,0,0,0,390,30]

{"sheet":"High Court Chart Data","index":6,"n_rows":10,"n_cols":15,"rows_kept":10,"cut":false,"hidden":true,"merged":[]}
["Financial Year","QUARTER","COURT_REF","COURT","INDICTMENTS_REG","INDICTMENTS_PH","INDICTMENTS_CALLED_CPH","S76_INDICTMENTS","TRIALS_CALLED","TRIALS_ELED","TRIALS_LOCT","% LOCT1","TRIALS_OUTSTANDING","SOL_CASES_FULLY_DISPOSED","% LOCT"]
["2019/20","Q1",2,"HIGH CT",248,253,100,25,168,107,5,{"$f":"IFERROR(HighChart[[#This Row],[TRIALS_LOCT]]/HighChart[[#This Row],[TRIALS_CALLED]],NA())","v":2.976190476190476E-2},315,182,{"$f":"IF(I2=0,0,K2/I2)","v":2.976190476190476E-2}]
["2019/20","Q2",2,"HIGH CT",272,241,114,22,219,146,4,{"$f":"IFERROR(HighChart[[#This Row],[TRIALS_LOCT]]/HighChart[[#This Row],[TRIALS_CALLED]],NA())","v":1.8264840182648401E-2},304,241,1.8264840182648401E-2]
["2019/20","Q3",2,"HIGH CT",274,267,115,24,190,120,22,{"$f":"IFERROR(HighChart[[#This Row],[TRIALS_LOCT]]/HighChart[[#This Row],[TRIALS_CALLED]],NA())","v":0.11578947368421053},369,206,0.11578947368421053]
["2019/20","Q4",2,"HIGH CT",230,220,108,23,235,125,18,{"$f":"IFERROR(HighChart[[#This Row],[TRIALS_LOCT]]/HighChart[[#This Row],[TRIALS_CALLED]],NA())","v":7.6595744680851063E-2},390,177,7.6595744680851063E-2]
["2020/21 YTD","Q1",2,"HIGH CT",231,92,40,17,0,0,0,{"$f":"IFERROR(HighChart[[#This Row],[TRIALS_LOCT]]/HighChart[[#This Row],[TRIALS_CALLED]],NA())","v":{"$error":"#N/A"}},390,30,0]
["2020/21 YTD","Q2",null,null,null,null,null,null,null,null,null,{"$f":"IFERROR(HighChart[[#This Row],[TRIALS_LOCT]]/HighChart[[#This Row],[TRIALS_CALLED]],NA())","v":{"$error":"#N/A"}},null,null,{"$f":"IF(I7=0,0,K7/I7)","v":0}]
["2020/21 YTD","Q3",null,null,null,null,null,null,null,null,null,{"$f":"IFERROR(HighChart[[#This Row],[TRIALS_LOCT]]/HighChart[[#This Row],[TRIALS_CALLED]],NA())","v":{"$error":"#N/A"}},null,null,0]
["2020/21 YTD","Q4",null,null,null,null,null,null,null,null,null,{"$f":"IFERROR(HighChart[[#This Row],[TRIALS_LOCT]]/HighChart[[#This Row],[TRIALS_CALLED]],NA())","v":{"$error":"#N/A"}},null,null,{"$f":"IF(I9=0,0,K9/I9)","v":0}]
["This data is only for The Scottish Courts and Tribunals Service Internal use. Please go to the index tab and navigate as required."]

{"sheet":"JP SC Raw Data","index":7,"n_rows":378,"n_cols":34,"rows_kept":378,"cut":false,"hidden":true,"merged":[]}
[null,"This data is only for The Scottish Courts and Tribunals Service Internal use. Please go to the index tab and navigate as required.",null,null,null,null,null,null,null,null,null,null,null,null,null,null,null,null,null,null,null,null,null,null,null,null,"Current Year","Current Quarter",null,"Previous year 2019/20",null,null,"Previous year 2018/19"]
[null,null,null,null,null,null,null,null,null,null,null,null,null,null,null,null,null,null,null,null,null,null,null,null,null,null,{"$f":"LOOKUP(2,1/($B:$B<>\"\"),$B:$B)","v":"2020/21"},{"$f":"LOOKUP(2,1/($C:$C<>\"\"),$C:$C)","v":"Q1"},null,"2019/20","Q4",null,"2018/19","Q4"]
["Sheriffdom","FINANCIAL_YEAR","QUARTER","COURT_REF","COURT_NAME","COURT_TYPE","SOL_PETITIONS","SOL_INDICTMENTS_REGISTERED","SOL_FIRST_DIET","SOL_CONT_FD","SOL_S76","SOL_TRIALS_CALLED","SOL_TRIAL_ELED","SOL_LOCT","SOL_OUTSTANDING_INDICTMENTS","SOL_CASES_FULLY_DISPOSED","SUM_COMPLAINTS_REGISTERED","SUM_CALLED_FOR_FIRST_TIME","SUM_CWP_HEARING","SUM_INTERMEDIATE_DIET","SUM_TRIALS_CALLED","SUM_TRIAL_ELED","SUM_LOCT","SUM_OUTSTANDING_COMPLAINTS","SUM_CASES_FULLY_DISPOSED"]
[{"$f":"VLOOKUP(D4,'Sheriffdom Look up'!$A$1:$E$102,5,FALSE)","v":"National JP"},"2019/20","Q1",1,"NATIONAL","J",0,0,0,0,0,0,0,0,0,0,7496,7329,4505,5139,2668,438,43,3640,7288]
[{"$f":"VLOOKUP(D5,'Sheriffdom Look up'!$A$1:$E$102,5,FALSE)","v":"National SC"},"2019/20","Q1",0,"NATIONAL","S",2502,1385,1241,699,246,835,299,19,449,1282,15912,15203,3666,16190,9818,1832,345,12088,14291]
[{"$f":"VLOOKUP(D6,'Sheriffdom Look up'!$A$1:$E$102,5,FALSE)","v":"Tayside, Central & Fife"},"2019/20","Q1",9240,"ALLOA","J",0,0,0,0,0,0,0,0,0,0,41,35,50,40,14,4,0,18,46]
[{"$f":"VLOOKUP(D7,'Sheriffdom Look up'!$A$1:$E$102,5,FALSE)","v":"South Strathclyde, Dumfries & Galloway"},"2019/20","Q1",9246,"DUMFRIES","J",0,0,0,0,0,0,0,0,0,0,549,573,253,149,53,19,0,112,506]
[{"$f":"VLOOKUP(D8,'Sheriffdom Look up'!$A$1:$E$102,5,FALSE)","v":"South Strathclyde, Dumfries & Galloway"},"2019/20","Q1",9250,"STRANRAER","J",0,0,0,0,0,0,0,0,0,0,218,263,111,51,22,6,1,50,234]
[{"$f":"VLOOKUP(D9,'Sheriffdom Look up'!$A$1:$E$102,5,FALSE)","v":"Grampian, Highland & Islands"},"2019/20","Q1",9251,"ABERDEEN","J",0,0,0,0,0,0,0,0,0,0,579,609,432,327,127,24,7,274,605]
[{"$f":"VLOOKUP(D10,'Sheriffdom Look up'!$A$1:$E$102,5,FALSE)","v":"Grampian, Highland & Islands"},"2019/20","Q1",9252,"BANFF","J",0,0,0,0,0,0,0,0,0,0,30,30,40,13,12,5,0,28,34]
[{"$f":"VLOOKUP(D11,'Sheriffdom Look up'!$A$1:$E$102,5,FALSE)","v":"Grampian, Highland & Islands"},"2019/20","Q1",9253,"PETERHEAD","J",0,0,0,0,0,0,0,0,0,0,99,99,76,54,30,9,0,44,106]
[{"$f":"VLOOKUP(D12,'Sheriffdom Look up'!$A$1:$E$102,5,FALSE)","v":"Tayside, Central & Fife"},"2019/20","Q1",9256,"DUNDEE","J",0,0,0,0,0,0,0,0,0,0,260,264,217,155,73,16,0,61,277]
[{"$f":"VLOOKUP(D13,'Sheriffdom Look up'!$A$1:$E$102,5,FALSE)","v":"North Strathclyde"},"2019/20","Q1",9261,"KILMARNOCK","J",0,0,0,0,0,0,0,0,0,0,256,223,132,159,67,13,2,110,226]
[{"$f":"VLOOKUP(D14,'Sheriffdom Look up'!$A$1:$E$102,5,FALSE)","v":"Tayside, Central & Fife"},"2019/20","Q1",9264,"FORFAR","J",0,0,0,0,0,0,0,0,0,0,135,122,49,63,35,6,0,51,99]
[{"$f":"VLOOKUP(D15,'Sheriffdom Look up'!$A$1:$E$102,5,FALSE)","v":"Lothian & Borders"},"2019/20","Q1",9278,"EDINBURGH","J",0,0,0,0,0,0,0,0,0,0,813,827,552,663,282,25,3,408,772]
[{"$f":"VLOOKUP(D16,'Sheriffdom Look up'!$A$1:$E$102,5,FALSE)","v":"Tayside, Central & Fife"},"2019/20","Q1",9282,"FALKIRK","J",0,0,0,0,0,0,0,0,0,0,140,134,110,122,51,10,0,76,144]
[{"$f":"VLOOKUP(D17,'Sheriffdom Look up'!$A$1:$E$102,5,FALSE)","v":"Tayside, Central & Fife"},"2019/20","Q1",9286,"DUNFERMLINE","J",0,0,0,0,0,0,0,0,0,0,104,79,68,102,38,11,1,35,119]
[{"$f":"VLOOKUP(D18,'Sheriffdom Look up'!$A$1:$E$102,5,FALSE)","v":"Tayside, Central & Fife"},"2019/20","Q1",9287,"KIRKCALDY","J",0,0,0,0,0,0,0,0,0,0,202,206,207,186,70,17,1,128,211]
[{"$f":"VLOOKUP(D19,'Sheriffdom Look up'!$A$1:$E$102,5,FALSE)","v":"North Strathclyde"},"2019/20","Q1",9289,"CAMPBELTOWN","J",0,0,0,0,0,0,0,0,0,0,12,12,3,2,3,2,0,3,10]
[{"$f":"VLOOKUP(D20,'Sheriffdom Look up'!$A$1:$E$102,5,FALSE)","v":"North Strathclyde"},"2019/20","Q1",9290,"DUNOON","J",0,0,0,0,0,0,0,0,0,0,28,28,13,7,5,0,0,5,21]
[{"$f":"VLOOKUP(D21,'Sheriffdom Look up'!$A$1:$E$102,5,FALSE)","v":"North Strathclyde"},"2019/20","Q1",9292,"LOCHGILPHEAD","J",0,0,0,0,0,0,0,0,0,0,15,15,4,8,7,0,0,4,16]
[{"$f":"VLOOKUP(D22,'Sheriffdom Look up'!$A$1:$E$102,5,FALSE)","v":"North Strathclyde"},"2019/20","Q1",9293,"OBAN","J",0,0,0,0,0,0,0,0,0,0,17,15,10,4,2,0,0,3,10]
[{"$f":"VLOOKUP(D23,'Sheriffdom Look up'!$A$1:$E$102,5,FALSE)","v":"Glasgow & Strathkelvin"},"2019/20","Q1",9295,"GLASGOW","J",0,0,0,0,0,0,0,0,0,0,1226,1221,470,1109,842,93,7,952,1414]
[{"$f":"VLOOKUP(D24,'Sheriffdom Look up'!$A$1:$E$102,5,FALSE)","v":"North Strathclyde"},"2019/20","Q1",9340,"GREENOCK","J",0,0,0,0,0,0,0,0,0,0,81,72,79,72,48,6,0,70,79]
[{"$f":"VLOOKUP(D25,'Sheriffdom Look up'!$A$1:$E$102,5,FALSE)","v":"Grampian, Highland & Islands"},"2019/20","Q1",9341,"ELGIN","J",0,0,0,0,0,0,0,0,0,0,155,117,81,83,26,3,0,59,98]
[{"$f":"VLOOKUP(D26,'Sheriffdom Look up'!$A$1:$E$102,5,FALSE)","v":"North Strathclyde"},"2019/20","Q1",9342,"PAISLEY","J",0,0,0,0,0,0,0,0,0,0,267,243,156,250,181,23,6,184,271]
[{"$f":"VLOOKUP(D27,'Sheriffdom Look up'!$A$1:$E$102,5,FALSE)","v":"Grampian, Highland & Islands"},"2019/20","Q1",9345,"FORT WILLIAM","J",0,0,0,0,0,0,0,0,0,0,71,69,53,22,11,4,0,17,62]
[{"$f":"VLOOKUP(D28,'Sheriffdom Look up'!$A$1:$E$102,5,FALSE)","v":"Grampian, Highland & Islands"},"2019/20","Q1",9346,"INVERNESS","J",0,0,0,0,0,0,0,0,0,0,307,316,217,226,94,18,0,147,367]
[{"$f":"VLOOKUP(D29,'Sheriffdom Look up'!$A$1:$E$102,5,FALSE)","v":"Grampian, Highland & Islands"},"2019/20","Q1",9348,"TAIN","J",0,0,0,0,0,0,0,0,0,0,93,72,47,21,7,2,0,29,57]
[{"$f":"VLOOKUP(D30,'Sheriffdom Look up'!$A$1:$E$102,5,FALSE)","v":"Lothian & Borders"},"2019/20","Q1",9351,"JEDBURGH","J",0,0,0,0,0,0,0,0,0,0,32,40,22,19,8,5,0,10,34]
[{"$f":"VLOOKUP(D31,'Sheriffdom Look up'!$A$1:$E$102,5,FALSE)","v":"Lothian & Borders"},"2019/20","Q1",9353,"SELKIRK","J",0,0,0,0,0,0,0,0,0,0,94,73,13,18,8,2,0,7,64]
[{"$f":"VLOOKUP(D32,'Sheriffdom Look up'!$A$1:$E$102,5,FALSE)","v":"South Strathclyde, Dumfries & Galloway"},"2019/20","Q1",9355,"AIRDRIE","J",0,0,0,0,0,0,0,0,0,0,228,250,172,163,84,23,1,121,199]
[{"$f":"VLOOKUP(D33,'Sheriffdom Look up'!$A$1:$E$102,5,FALSE)","v":"Tayside, Central & Fife"},"2019/20","Q1",9358,"PERTH","J",0,0,0,0,0,0,0,0,0,0,343,300,200,100,56,11,4,109,284]
[{"$f":"VLOOKUP(D34,'Sheriffdom Look up'!$A$1:$E$102,5,FALSE)","v":"South Strathclyde, Dumfries & Galloway"},"2019/20","Q1",9360,"AYR","J",0,0,0,0,0,0,0,0,0,0,143,154,102,124,51,18,2,49,148]
[{"$f":"VLOOKUP(D35,'Sheriffdom Look up'!$A$1:$E$102,5,FALSE)","v":"South Strathclyde, Dumfries & Galloway"},"2019/20","Q1",9366,"HAMILTON","J",0,0,0,0,0,0,0,0,0,0,485,428,219,450,213,41,4,283,344]
[{"$f":"VLOOKUP(D36,'Sheriffdom Look up'!$A$1:$E$102,5,FALSE)","v":"South Strathclyde, Dumfries & Galloway"},"2019/20","Q1",9367,"LANARK","J",0,0,0,0,0,0,0,0,0,0,56,55,38,69,37,4,0,25,70]
[{"$f":"VLOOKUP(D37,'Sheriffdom Look up'!$A$1:$E$102,5,FALSE)","v":"Tayside, Central & Fife"},"2019/20","Q1",9372,"STIRLING","J",0,0,0,0,0,0,0,0,0,0,90,89,109,63,32,8,1,36,98]
[{"$f":"VLOOKUP(D38,'Sheriffdom Look up'!$A$1:$E$102,5,FALSE)","v":"North Strathclyde"},"2019/20","Q1",9376,"DUMBARTON","J",0,0,0,0,0,0,0,0,0,0,171,160,93,94,46,4,0,92,132]
[{"$f":"VLOOKUP(D39,'Sheriffdom Look up'!$A$1:$E$102,5,FALSE)","v":"Lothian & Borders"},"2019/20","Q1",9380,"LIVINGSTON","J",0,0,0,0,0,0,0,0,0,0,156,136,107,151,33,6,3,40,131]
[{"$f":"VLOOKUP(D40,'Sheriffdom Look up'!$A$1:$E$102,5,FALSE)","v":"Grampian, Highland & Islands"},"2019/20","Q1",9701,"ABERDEEN","S",160,107,100,46,34,59,24,2,50,107,1127,1069,356,1134,506,131,36,1042,882]
[{"$f":"VLOOKUP(D41,'Sheriffdom Look up'!$A$1:$E$102,5,FALSE)","v":"South Strathclyde, Dumfries & Galloway"},"2019/20","Q1",9702,"AIRDRIE","S",73,27,43,31,8,38,16,0,23,44,626,596,133,757,445,109,4,366,592]
[{"$f":"VLOOKUP(D42,'Sheriffdom Look up'!$A$1:$E$102,5,FALSE)","v":"Tayside, Central & Fife"},"2019/20","Q1",9703,"ALLOA","S",25,0,0,0,0,0,0,0,0,1,194,180,63,211,100,17,11,157,141]
[{"$f":"VLOOKUP(D43,'Sheriffdom Look up'!$A$1:$E$102,5,FALSE)","v":"South Strathclyde, Dumfries & Galloway"},"2019/20","Q1",9704,"AYR","S",64,41,39,27,8,31,7,0,17,41,517,437,94,484,215,57,8,262,413]
[{"$f":"VLOOKUP(D44,'Sheriffdom Look up'!$A$1:$E$102,5,FALSE)","v":"Grampian, Highland & Islands"},"2019/20","Q1",9711,"BANFF","S",2,0,0,0,0,0,0,0,0,0,34,29,23,58,43,9,6,56,38]
[{"$f":"VLOOKUP(D45,'Sheriffdom Look up'!$A$1:$E$102,5,FALSE)","v":"North Strathclyde"},"2019/20","Q1",9716,"CAMPBELTOWN","S",1,1,1,1,0,0,0,0,1,0,25,24,3,28,17,4,1,23,29]
[{"$f":"VLOOKUP(D46,'Sheriffdom Look up'!$A$1:$E$102,5,FALSE)","v":"North Strathclyde"},"2019/20","Q1",9723,"DUMBARTON","S",62,42,31,22,9,34,11,1,11,41,335,338,64,383,245,48,23,307,304]
[{"$f":"VLOOKUP(D47,'Sheriffdom Look up'!$A$1:$E$102,5,FALSE)","v":"South Strathclyde, Dumfries & Galloway"},"2019/20","Q1",9724,"DUMFRIES","S",44,27,22,7,3,14,6,0,7,23,372,362,54,250,183,66,0,205,391]
[{"$f":"VLOOKUP(D48,'Sheriffdom Look up'!$A$1:$E$102,5,FALSE)","v":"Tayside, Central & Fife"},"2019/20","Q1",9726,"DUNDEE","S",136,98,87,32,20,64,21,1,36,90,672,593,173,666,448,83,3,529,650]
[{"$f":"VLOOKUP(D49,'Sheriffdom Look up'!$A$1:$E$102,5,FALSE)","v":"Tayside, Central & Fife"},"2019/20","Q1",9727,"DUNFERMLINE","S",58,32,37,29,6,16,6,1,11,32,340,353,102,393,187,30,12,276,373]
[{"$f":"VLOOKUP(D50,'Sheriffdom Look up'!$A$1:$E$102,5,FALSE)","v":"North Strathclyde"},"2019/20","Q1",9728,"DUNOON","S",5,0,3,2,0,4,1,0,0,4,70,69,26,46,43,13,0,53,55]
[{"$f":"VLOOKUP(D51,'Sheriffdom Look up'!$A$1:$E$102,5,FALSE)","v":"Lothian & Borders"},"2019/20","Q1",9741,"EDINBURGH","S",318,198,174,148,26,92,30,0,47,148,2028,1860,442,1908,1073,98,12,1542,1500]
[{"$f":"VLOOKUP(D52,'Sheriffdom Look up'!$A$1:$E$102,5,FALSE)","v":"Grampian, Highland & Islands"},"2019/20","Q1",9742,"ELGIN","S",49,19,21,22,3,7,1,0,6,19,224,212,75,237,101,19,5,172,194]
[{"$f":"VLOOKUP(D53,'Sheriffdom Look up'!$A$1:$E$102,5,FALSE)","v":"Tayside, Central & Fife"},"2019/20","Q1",9751,"FALKIRK","S",70,21,25,35,10,27,10,2,15,37,483,469,115,491,284,39,11,321,436]
[{"$f":"VLOOKUP(D54,'Sheriffdom Look up'!$A$1:$E$102,5,FALSE)","v":"Tayside, Central & Fife"},"2019/20","Q1",9752,"FORFAR","S",48,0,0,0,0,0,0,0,0,1,261,258,62,261,142,28,15,214,246]
[{"$f":"VLOOKUP(D55,'Sheriffdom Look up'!$A$1:$E$102,5,FALSE)","v":"Grampian, Highland & Islands"},"2019/20","Q1",9753,"FORT WILLIAM","S",3,2,0,0,2,0,0,0,0,0,63,55,33,68,33,9,5,58,51]
[{"$f":"VLOOKUP(D56,'Sheriffdom Look up'!$A$1:$E$102,5,FALSE)","v":"Glasgow & Strathkelvin"},"2019/20","Q1",9761,"GLASGOW","S",438,330,247,56,42,175,63,0,109,245,2637,2716,395,2668,2497,392,67,2271,2683]
[{"$f":"VLOOKUP(D57,'Sheriffdom Look up'!$A$1:$E$102,5,FALSE)","v":"North Strathclyde"},"2019/20","Q1",9762,"GREENOCK","S",46,17,21,5,2,8,4,0,8,16,232,223,55,273,157,41,12,199,203]
[{"$f":"VLOOKUP(D58,'Sheriffdom Look up'!$A$1:$E$102,5,FALSE)","v":"South Strathclyde, Dumfries & Galloway"},"2019/20","Q1",9772,"HAMILTON","S",172,97,80,36,6,64,26,4,22,76,1138,1036,133,1050,647,148,10,852,945]
[{"$f":"VLOOKUP(D59,'Sheriffdom Look up'!$A$1:$E$102,5,FALSE)","v":"Grampian, Highland & Islands"},"2019/20","Q1",9781,"INVERNESS","S",66,49,43,41,8,9,3,0,6,39,409,373,137,494,177,19,3,327,345]
[{"$f":"VLOOKUP(D60,'Sheriffdom Look up'!$A$1:$E$102,5,FALSE)","v":"Lothian & Borders"},"2019/20","Q1",9791,"JEDBURGH","S",20,7,8,12,4,0,0,0,4,9,99,102,13,130,87,8,2,68,116]
[{"$f":"VLOOKUP(D61,'Sheriffdom Look up'!$A$1:$E$102,5,FALSE)","v":"North Strathclyde"},"2019/20","Q1",9801,"KILMARNOCK","S",130,66,52,19,13,40,18,2,12,69,730,650,92,560,361,79,14,443,676]
[{"$f":"VLOOKUP(D62,'Sheriffdom Look up'!$A$1:$E$102,5,FALSE)","v":"Tayside, Central & Fife"},"2019/20","Q1",9803,"KIRKCALDY","S",107,41,24,12,17,30,12,4,9,42,610,580,231,659,343,73,13,469,571]
[{"$f":"VLOOKUP(D63,'Sheriffdom Look up'!$A$1:$E$102,5,FALSE)","v":"Grampian, Highland & Islands"},"2019/20","Q1",9805,"KIRKWALL","S",6,2,3,4,0,0,0,0,2,1,46,50,18,27,25,9,4,19,53]
[{"$f":"VLOOKUP(D64,'Sheriffdom Look up'!$A$1:$E$102,5,FALSE)","v":"South Strathclyde, Dumfries & Galloway"},"2019/20","Q1",9811,"LANARK","S",27,6,5,4,0,7,1,0,1,6,127,120,33,121,70,18,8,93,112]
[{"$f":"VLOOKUP(D65,'Sheriffdom Look up'!$A$1:$E$102,5,FALSE)","v":"Grampian, Highland & Islands"},"2019/20","Q1",9812,"LERWICK","S",9,5,2,0,3,3,0,0,0,6,68,63,30,21,14,3,0,18,42]
[{"$f":"VLOOKUP(D66,'Sheriffdom Look up'!$A$1:$E$102,5,FALSE)","v":"Grampian, Highland & Islands"},"2019/20","Q1",9814,"LOCHMADDY","S",1,0,1,0,0,0,0,0,1,0,7,7,4,2,1,0,0,8,1]
[{"$f":"VLOOKUP(D67,'Sheriffdom Look up'!$A$1:$E$102,5,FALSE)","v":"Lothian & Borders"},"2019/20","Q1",9815,"LIVINGSTON","S",80,26,40,24,5,12,2,0,4,38,432,385,147,613,260,41,21,260,404]
[{"$f":"VLOOKUP(D68,'Sheriffdom Look up'!$A$1:$E$102,5,FALSE)","v":"North Strathclyde"},"2019/20","Q1",9841,"OBAN","S",3,0,2,1,0,4,1,2,2,2,62,61,13,34,24,6,0,39,47]
[{"$f":"VLOOKUP(D69,'Sheriffdom Look up'!$A$1:$E$102,5,FALSE)","v":"North Strathclyde"},"2019/20","Q1",9851,"PAISLEY","S",93,39,53,39,2,45,18,0,16,62,624,612,121,834,489,78,10,445,622]
[{"$f":"VLOOKUP(D70,'Sheriffdom Look up'!$A$1:$E$102,5,FALSE)","v":"Tayside, Central & Fife"},"2019/20","Q1",9853,"PERTH","S",69,40,25,6,5,21,10,0,12,32,343,349,98,424,183,68,13,348,305]
[{"$f":"VLOOKUP(D71,'Sheriffdom Look up'!$A$1:$E$102,5,FALSE)","v":"Grampian, Highland & Islands"},"2019/20","Q1",9854,"PETERHEAD","S",47,0,0,0,0,0,0,0,0,0,283,274,74,176,96,22,9,198,222]
[{"$f":"VLOOKUP(D72,'Sheriffdom Look up'!$A$1:$E$102,5,FALSE)","v":"Grampian, Highland & Islands"},"2019/20","Q1",9855,"PORTREE","S",2,1,1,0,0,0,0,0,0,0,19,32,29,16,12,2,0,22,21]
[{"$f":"VLOOKUP(D73,'Sheriffdom Look up'!$A$1:$E$102,5,FALSE)","v":"Lothian & Borders"},"2019/20","Q1",9871,"SELKIRK","S",8,3,6,4,1,3,1,0,3,6,131,121,20,108,70,8,4,100,107]
[{"$f":"VLOOKUP(D74,'Sheriffdom Look up'!$A$1:$E$102,5,FALSE)","v":"Tayside, Central & Fife"},"2019/20","Q1",9872,"STIRLING","S",23,27,33,23,4,27,6,0,13,34,209,210,101,231,107,26,1,171,179]
[{"$f":"VLOOKUP(D75,'Sheriffdom Look up'!$A$1:$E$102,5,FALSE)","v":"Grampian, Highland & Islands"},"2019/20","Q1",9874,"STORNOWAY","S",10,3,1,1,2,0,0,0,0,0,52,55,30,39,11,1,0,19,47]
[{"$f":"VLOOKUP(D76,'Sheriffdom Look up'!$A$1:$E$102,5,FALSE)","v":"South Strathclyde, Dumfries & Galloway"},"2019/20","Q1",9875,"STRANRAER","S",16,3,4,3,2,0,0,0,0,5,110,112,21,118,54,13,0,58,126]
[{"$f":"VLOOKUP(D77,'Sheriffdom Look up'!$A$1:$E$102,5,FALSE)","v":"Grampian, Highland & Islands"},"2019/20","Q1",9881,"TAIN","S",8,0,0,0,0,0,0,0,0,0,94,85,18,138,32,7,2,50,78]
[{"$f":"VLOOKUP(D78,'Sheriffdom Look up'!$A$1:$E$102,5,FALSE)","v":"Grampian, Highland & Islands"},"2019/20","Q1",9891,"WICK","S",3,8,7,7,1,1,1,0,1,6,79,83,35,79,36,10,0,28,91]
["National JP","2019/20","Q2",1,"National","J",0,0,0,0,0,0,0,0,0,0,8334,8168,4574,5062,2440,362,61,3452,7586]
["National SC","2019/20","Q2",0,"National","S",2506,1327,1288,773,278,792,291,9,488,1337,16793,15711,3536,17649,9787,1734,287,13186,14348]
[{"$f":"VLOOKUP(D81,'Sheriffdom Look up'!$A$1:$E$102,5,FALSE)","v":"Tayside, Central & Fife"},"2019/20","Q2",9240,"ALLOA","J",0,0,0,0,0,0,0,0,0,0,46,49,25,39,13,5,0,22,43]
[{"$f":"VLOOKUP(D82,'Sheriffdom Look up'!$A$1:$E$102,5,FALSE)","v":"South Strathclyde, Dumfries & Galloway"},"2019/20","Q2",9246,"DUMFRIES","J",0,0,0,0,0,0,0,0,0,0,609,564,359,115,62,19,3,122,566]
[{"$f":"VLOOKUP(D83,'Sheriffdom Look up'!$A$1:$E$102,5,FALSE)","v":"South Strathclyde, Dumfries & Galloway"},"2019/20","Q2",9250,"STRANRAER","J",0,0,0,0,0,0,0,0,0,0,203,203,94,56,20,7,1,37,200]
[{"$f":"VLOOKUP(D84,'Sheriffdom Look up'!$A$1:$E$102,5,FALSE)","v":"Grampian, Highland & Islands"},"2019/20","Q2",9251,"ABERDEEN","J",0,0,0,0,0,0,0,0,0,0,808,767,303,342,128,29,5,248,730]
[{"$f":"VLOOKUP(D85,'Sheriffdom Look up'!$A$1:$E$102,5,FALSE)","v":"Grampian, Highland & Islands"},"2019/20","Q2",9252,"BANFF","J",0,0,0,0,0,0,0,0,0,0,24,13,4,19,9,4,0,24,13]
[{"$f":"VLOOKUP(D86,'Sheriffdom Look up'!$A$1:$E$102,5,FALSE)","v":"Grampian, Highland & Islands"},"2019/20","Q2",9253,"PETERHEAD","J",0,0,0,0,0,0,0,0,0,0,115,110,82,67,19,4,0,60,91]
[{"$f":"VLOOKUP(D87,'Sheriffdom Look up'!$A$1:$E$102,5,FALSE)","v":"Tayside, Central & Fife"},"2019/20","Q2",9256,"DUNDEE","J",0,0,0,0,0,0,0,0,0,0,259,301,271,114,59,8,0,76,290]
[{"$f":"VLOOKUP(D88,'Sheriffdom Look up'!$A$1:$E$102,5,FALSE)","v":"North Strathclyde"},"2019/20","Q2",9261,"KILMARNOCK","J",0,0,0,0,0,0,0,0,0,0,264,268,138,145,63,9,2,120,251]
[{"$f":"VLOOKUP(D89,'Sheriffdom Look up'!$A$1:$E$102,5,FALSE)","v":"Tayside, Central & Fife"},"2019/20","Q2",9264,"FORFAR","J",0,0,0,0,0,0,0,0,0,0,129,143,72,69,30,5,1,33,149]
[{"$f":"VLOOKUP(D90,'Sheriffdom Look up'!$A$1:$E$102,5,FALSE)","v":"Lothian & Borders"},"2019/20","Q2",9278,"EDINBURGH","J",0,0,0,0,0,0,0,0,0,0,988,896,561,660,350,38,6,359,816]
[{"$f":"VLOOKUP(D91,'Sheriffdom Look up'!$A$1:$E$102,5,FALSE)","v":"Tayside, Central & Fife"},"2019/20","Q2",9282,"FALKIRK","J",0,0,0,0,0,0,0,0,0,0,163,158,95,115,57,12,0,69,151]
[{"$f":"VLOOKUP(D92,'Sheriffdom Look up'!$A$1:$E$102,5,FALSE)","v":"Tayside, Central & Fife"},"2019/20","Q2",9286,"DUNFERMLINE","J",0,0,0,0,0,0,0,0,0,0,135,164,91,64,28,4,0,30,135]
[{"$f":"VLOOKUP(D93,'Sheriffdom Look up'!$A$1:$E$102,5,FALSE)","v":"Tayside, Central & Fife"},"2019/20","Q2",9287,"KIRKCALDY","J",0,0,0,0,0,0,0,0,0,0,239,236,173,133,77,17,0,107,226]
[{"$f":"VLOOKUP(D94,'Sheriffdom Look up'!$A$1:$E$102,5,FALSE)","v":"North Strathclyde"},"2019/20","Q2",9289,"CAMPBELTOWN","J",0,0,0,0,0,0,0,0,0,0,9,10,3,5,5,1,0,4,11]
[{"$f":"VLOOKUP(D95,'Sheriffdom Look up'!$A$1:$E$102,5,FALSE)","v":"North Strathclyde"},"2019/20","Q2",9290,"DUNOON","J",0,0,0,0,0,0,0,0,0,0,30,30,19,10,8,1,0,6,25]
[{"$f":"VLOOKUP(D96,'Sheriffdom Look up'!$A$1:$E$102,5,FALSE)","v":"North Strathclyde"},"2019/20","Q2",9292,"LOCHGILPHEAD","J",0,0,0,0,0,0,0,0,0,0,14,14,9,8,4,0,0,11,6]
[{"$f":"VLOOKUP(D97,'Sheriffdom Look up'!$A$1:$E$102,5,FALSE)","v":"North Strathclyde"},"2019/20","Q2",9293,"OBAN","J",0,0,0,0,0,0,0,0,0,0,12,19,9,14,7,0,0,6,21]
[{"$f":"VLOOKUP(D98,'Sheriffdom Look up'!$A$1:$E$102,5,FALSE)","v":"Glasgow & Strathkelvin"},"2019/20","Q2",9295,"GLASGOW","J",0,0,0,0,0,0,0,0,0,0,1449,1401,460,1047,603,55,9,862,1257]
[{"$f":"VLOOKUP(D99,'Sheriffdom Look up'!$A$1:$E$102,5,FALSE)","v":"North Strathclyde"},"2019/20","Q2",9340,"GREENOCK","J",0,0,0,0,0,0,0,0,0,0,86,93,57,112,44,5,1,70,70]
[{"$f":"VLOOKUP(D100,'Sheriffdom Look up'!$A$1:$E$102,5,FALSE)","v":"Grampian, Highland & Islands"},"2019/20","Q2",9341,"ELGIN","J",0,0,0,0,0,0,0,0,0,0,101,132,100,86,33,7,1,77,126]
[{"$f":"VLOOKUP(D101,'Sheriffdom Look up'!$A$1:$E$102,5,FALSE)","v":"North Strathclyde"},"2019/20","Q2",9342,"PAISLEY","J",0,0,0,0,0,0,0,0,0,0,313,302,165,236,133,19,2,166,268]
[{"$f":"VLOOKUP(D102,'Sheriffdom Look up'!$A$1:$E$102,5,FALSE)","v":"Grampian, Highland & Islands"},"2019/20","Q2",9345,"FORT WILLIAM","J",0,0,0,0,0,0,0,0,0,0,85,64,57,27,7,1,0,11,67]
[{"$f":"VLOOKUP(D103,'Sheriffdom Look up'!$A$1:$E$102,5,FALSE)","v":"Grampian, Highland & Islands"},"2019/20","Q2",9346,"INVERNESS","J",0,0,0,0,0,0,0,0,0,0,274,294,196,231,89,14,1,111,288]
[{"$f":"VLOOKUP(D104,'Sheriffdom Look up'!$A$1:$E$102,5,FALSE)","v":"Grampian, Highland & Islands"},"2019/20","Q2",9348,"TAIN","J",0,0,0,0,0,0,0,0,0,0,58,56,41,48,15,2,0,19,56]
[{"$f":"VLOOKUP(D105,'Sheriffdom Look up'!$A$1:$E$102,5,FALSE)","v":"Lothian & Borders"},"2019/20","Q2",9351,"JEDBURGH","J",0,0,0,0,0,0,0,0,0,0,38,28,25,24,6,1,0,6,34]
[{"$f":"VLOOKUP(D106,'Sheriffdom Look up'!$A$1:$E$102,5,FALSE)","v":"Lothian & Borders"},"2019/20","Q2",9353,"SELKIRK","J",0,0,0,0,0,0,0,0,0,0,40,137,53,22,7,0,0,11,121]
[{"$f":"VLOOKUP(D107,'Sheriffdom Look up'!$A$1:$E$102,5,FALSE)","v":"South Strathclyde, Dumfries & Galloway"},"2019/20","Q2",9355,"AIRDRIE","J",0,0,0,0,0,0,0,0,0,0,241,213,156,230,86,15,1,105,198]
[{"$f":"VLOOKUP(D108,'Sheriffdom Look up'!$A$1:$E$102,5,FALSE)","v":"Tayside, Central & Fife"},"2019/20","Q2",9358,"PERTH","J",0,0,0,0,0,0,0,0,0,0,401,416,208,85,52,9,4,123,394]
[{"$f":"VLOOKUP(D109,'Sheriffdom Look up'!$A$1:$E$102,5,FALSE)","v":"South Strathclyde, Dumfries & Galloway"},"2019/20","Q2",9360,"AYR","J",0,0,0,0,0,0,0,0,0,0,174,144,110,93,49,11,2,55,131]
[{"$f":"VLOOKUP(D110,'Sheriffdom Look up'!$A$1:$E$102,5,FALSE)","v":"South Strathclyde, Dumfries & Galloway"},"2019/20","Q2",9366,"HAMILTON","J",0,0,0,0,0,0,0,0,0,0,421,352,251,499,220,30,16,288,355]
[{"$f":"VLOOKUP(D111,'Sheriffdom Look up'!$A$1:$E$102,5,FALSE)","v":"South Strathclyde, Dumfries & Galloway"},"2019/20","Q2",9367,"LANARK","J",0,0,0,0,0,0,0,0,0,0,107,91,34,42,25,3,0,30,69]
[{"$f":"VLOOKUP(D112,'Sheriffdom Look up'!$A$1:$E$102,5,FALSE)","v":"Tayside, Central & Fife"},"2019/20","Q2",9372,"STIRLING","J",0,0,0,0,0,0,0,0,0,0,93,102,89,54,31,10,1,38,91]
[{"$f":"VLOOKUP(D113,'Sheriffdom Look up'!$A$1:$E$102,5,FALSE)","v":"North Strathclyde"},"2019/20","Q2",9376,"DUMBARTON","J",0,0,0,0,0,0,0,0,0,0,173,182,134,131,52,9,4,95,165]
[{"$f":"VLOOKUP(D114,'Sheriffdom Look up'!$A$1:$E$102,5,FALSE)","v":"Lothian & Borders"},"2019/20","Q2",9380,"LIVINGSTON","J",0,0,0,0,0,0,0,0,0,0,233,216,130,120,49,8,1,51,172]
[{"$f":"VLOOKUP(D115,'Sheriffdom Look up'!$A$1:$E$102,5,FALSE)","v":"Grampian, Highland & Islands"},"2019/20","Q2",9701,"ABERDEEN","S",162,142,102,48,47,65,31,3,56,128,999,882,241,1184,520,153,31,1059,865]
[{"$f":"VLOOKUP(D116,'Sheriffdom Look up'!$A$1:$E$102,5,FALSE)","v":"South Strathclyde, Dumfries & Galloway"},"2019/20","Q2",9702,"AIRDRIE","S",89,33,56,32,6,41,11,0,21,52,620,630,171,734,423,85,3,421,578]
[{"$f":"VLOOKUP(D117,'Sheriffdom Look up'!$A$1:$E$102,5,FALSE)","v":"Tayside, Central & Fife"},"2019/20","Q2",9703,"ALLOA","S",51,0,0,0,0,0,0,0,0,1,199,193,51,247,107,13,10,180,171]
[{"$f":"VLOOKUP(D118,'Sheriffdom Look up'!$A$1:$E$102,5,FALSE)","v":"South Strathclyde, Dumfries & Galloway"},"2019/20","Q2",9704,"AYR","S",64,35,27,22,10,25,7,0,8,38,501,491,143,503,205,44,7,326,421]
[{"$f":"VLOOKUP(D119,'Sheriffdom Look up'!$A$1:$E$102,5,FALSE)","v":"Grampian, Highland & Islands"},"2019/20","Q2",9711,"BANFF","S",4,0,0,0,0,0,0,0,0,0,31,33,19,90,46,11,3,58,46]
[{"$f":"VLOOKUP(D120,'Sheriffdom Look up'!$A$1:$E$102,5,FALSE)","v":"North Strathclyde"},"2019/20","Q2",9716,"CAMPBELTOWN","S",3,1,1,0,0,0,0,0,1,0,39,37,5,20,20,6,1,30,27]
[{"$f":"VLOOKUP(D121,'Sheriffdom Look up'!$A$1:$E$102,5,FALSE)","v":"North Strathclyde"},"2019/20","Q2",9723,"DUMBARTON","S",42,33,36,18,7,22,11,0,9,47,400,365,115,398,233,42,18,340,321]
[{"$f":"VLOOKUP(D122,'Sheriffdom Look up'!$A$1:$E$102,5,FALSE)","v":"South Strathclyde, Dumfries & Galloway"},"2019/20","Q2",9724,"DUMFRIES","S",47,22,20,10,9,9,6,0,4,20,443,429,92,257,177,53,0,254,370]
[{"$f":"VLOOKUP(D123,'Sheriffdom Look up'!$A$1:$E$102,5,FALSE)","v":"Tayside, Central & Fife"},"2019/20","Q2",9726,"DUNDEE","S",135,102,82,39,16,64,27,2,33,102,755,642,114,590,356,61,5,562,597]
[{"$f":"VLOOKUP(D124,'Sheriffdom Look up'!$A$1:$E$102,5,FALSE)","v":"Tayside, Central & Fife"},"2019/20","Q2",9727,"DUNFERMLINE","S",54,31,34,26,9,18,4,1,10,37,377,358,84,383,174,29,5,274,328]
[{"$f":"VLOOKUP(D125,'Sheriffdom Look up'!$A$1:$E$102,5,FALSE)","v":"North Strathclyde"},"2019/20","Q2",9728,"DUNOON","S",2,4,3,2,0,2,1,0,0,2,83,77,13,73,47,12,2,64,67]
[{"$f":"VLOOKUP(D126,'Sheriffdom Look up'!$A$1:$E$102,5,FALSE)","v":"Lothian & Borders"},"2019/20","Q2",9741,"EDINBURGH","S",349,192,172,165,32,108,21,0,58,144,2253,2025,558,2600,1334,131,11,1790,1776]
[{"$f":"VLOOKUP(D127,'Sheriffdom Look up'!$A$1:$E$102,5,FALSE)","v":"Grampian, Highland & Islands"},"2019/20","Q2",9742,"ELGIN","S",32,19,18,24,3,10,4,0,7,15,208,176,49,280,89,24,4,152,212]
[{"$f":"VLOOKUP(D128,'Sheriffdom Look up'!$A$1:$E$102,5,FALSE)","v":"Tayside, Central & Fife"},"2019/20","Q2",9751,"FALKIRK","S",61,28,21,13,4,21,6,0,10,41,545,511,94,521,289,47,16,390,432]
[{"$f":"VLOOKUP(D129,'Sheriffdom Look up'!$A$1:$E$102,5,FALSE)","v":"Tayside, Central & Fife"},"2019/20","Q2",9752,"FORFAR","S",44,0,0,0,0,0,0,0,0,0,309,299,50,319,168,20,2,194,318]
[{"$f":"VLOOKUP(D130,'Sheriffdom Look up'!$A$1:$E$102,5,FALSE)","v":"Grampian, Highland & Islands"},"2019/20","Q2",9753,"FORT WILLIAM","S",4,0,0,0,0,0,0,0,0,1,54,49,24,91,35,7,1,62,51]
[{"$f":"VLOOKUP(D131,'Sheriffdom Look up'!$A$1:$E$102,5,FALSE)","v":"Glasgow & Strathkelvin"},"2019/20","Q2",9761,"GLASGOW","S",454,256,298,78,36,181,62,0,124,269,2677,2682,307,2683,2159,290,15,2263,2526]
[{"$f":"VLOOKUP(D132,'Sheriffdom Look up'!$A$1:$E$102,5,FALSE)","v":"North Strathclyde"},"2019/20","Q2",9762,"GREENOCK","S",35,19,16,4,6,12,7,0,4,18,259,257,48,271,199,34,18,217,214]
[{"$f":"VLOOKUP(D133,'Sheriffdom Look up'!$A$1:$E$102,5,FALSE)","v":"South Strathclyde, Dumfries & Galloway"},"2019/20","Q2",9772,"HAMILTON","S",171,101,85,40,18,45,15,0,33,101,1082,928,111,1276,643,148,19,855,941]
[{"$f":"VLOOKUP(D134,'Sheriffdom Look up'!$A$1:$E$102,5,FALSE)","v":"Grampian, Highland & Islands"},"2019/20","Q2",9781,"INVERNESS","S",66,31,35,77,1,11,6,1,21,26,417,347,101,534,184,22,4,395,321]
[{"$f":"VLOOKUP(D135,'Sheriffdom Look up'!$A$1:$E$102,5,FALSE)","v":"Lothian & Borders"},"2019/20","Q2",9791,"JEDBURGH","S",14,7,7,3,3,6,2,0,2,6,132,134,17,156,63,12,1,84,125]
[{"$f":"VLOOKUP(D136,'Sheriffdom Look up'!$A$1:$E$102,5,FALSE)","v":"North Strathclyde"},"2019/20","Q2",9801,"KILMARNOCK","S",90,74,64,20,17,31,16,0,8,63,834,786,115,590,363,88,22,559,637]
[{"$f":"VLOOKUP(D137,'Sheriffdom Look up'!$A$1:$E$102,5,FALSE)","v":"Tayside, Central & Fife"},"2019/20","Q2",9803,"KIRKCALDY","S",108,35,29,13,4,17,9,0,12,30,655,612,217,736,371,93,16,517,577]
[{"$f":"VLOOKUP(D138,'Sheriffdom Look up'!$A$1:$E$102,5,FALSE)","v":"Grampian, Highland & Islands"},"2019/20","Q2",9805,"KIRKWALL","S",3,1,0,1,1,1,1,0,1,3,67,57,23,22,15,6,2,15,59]
[{"$f":"VLOOKUP(D139,'Sheriffdom Look up'!$A$1:$E$102,5,FALSE)","v":"South Strathclyde, Dumfries & Galloway"},"2019/20","Q2",9811,"LANARK","S",20,2,11,9,0,3,1,0,4,4,135,138,39,161,84,21,1,97,130]
[{"$f":"VLOOKUP(D140,'Sheriffdom Look up'!$A$1:$E$102,5,FALSE)","v":"Grampian, Highland & Islands"},"2019/20","Q2",9812,"LERWICK","S",5,7,4,0,3,0,0,0,3,3,64,69,47,40,16,3,0,30,59]
[{"$f":"VLOOKUP(D141,'Sheriffdom Look up'!$A$1:$E$102,5,FALSE)","v":"Grampian, Highland & Islands"},"2019/20","Q2",9814,"LOCHMADDY","S",0,0,0,0,0,1,1,0,0,1,7,6,4,11,3,0,0,3,13]
[{"$f":"VLOOKUP(D142,'Sheriffdom Look up'!$A$1:$E$102,5,FALSE)","v":"Lothian & Borders"},"2019/20","Q2",9815,"LIVINGSTON","S",85,36,30,32,11,12,5,1,10,49,482,455,201,578,230,24,11,298,390]
[{"$f":"VLOOKUP(D143,'Sheriffdom Look up'!$A$1:$E$102,5,FALSE)","v":"North Strathclyde"},"2019/20","Q2",9841,"OBAN","S",6,6,1,2,0,4,3,0,0,4,55,49,14,52,36,8,2,39,59]
[{"$f":"VLOOKUP(D144,'Sheriffdom Look up'!$A$1:$E$102,5,FALSE)","v":"North Strathclyde"},"2019/20","Q2",9851,"PAISLEY","S",101,39,44,35,13,35,15,0,19,47,686,645,142,816,463,81,21,584,490]
[{"$f":"VLOOKUP(D145,'Sheriffdom Look up'!$A$1:$E$102,5,FALSE)","v":"Tayside, Central & Fife"},"2019/20","Q2",9853,"PERTH","S",56,23,36,17,7,21,8,0,15,30,330,325,81,444,220,68,15,383,287]
[{"$f":"VLOOKUP(D146,'Sheriffdom Look up'!$A$1:$E$102,5,FALSE)","v":"Grampian, Highland & Islands"},"2019/20","Q2",9854,"PETERHEAD","S",56,0,0,0,0,0,0,0,0,0,279,235,51,160,99,22,10,209,210]
[{"$f":"VLOOKUP(D147,'Sheriffdom Look up'!$A$1:$E$102,5,FALSE)","v":"Grampian, Highland & Islands"},"2019/20","Q2",9855,"PORTREE","S",5,1,1,0,0,1,0,0,0,2,22,26,11,24,18,3,1,16,26]
[{"$f":"VLOOKUP(D148,'Sheriffdom Look up'!$A$1:$E$102,5,FALSE)","v":"Lothian & Borders"},"2019/20","Q2",9871,"SELKIRK","S",20,4,4,9,3,3,2,0,0,7,176,173,28,183,101,15,3,101,171]
[{"$f":"VLOOKUP(D149,'Sheriffdom Look up'!$A$1:$E$102,5,FALSE)","v":"Tayside, Central & Fife"},"2019/20","Q2",9872,"STIRLING","S",35,25,40,20,6,20,6,1,12,32,252,238,73,299,141,27,3,186,226]
[{"$f":"VLOOKUP(D150,'Sheriffdom Look up'!$A$1:$E$102,5,FALSE)","v":"Grampian, Highland & Islands"},"2019/20","Q2",9874,"STORNOWAY","S",1,3,2,4,0,0,0,0,0,1,53,48,32,45,14,3,0,15,40]
[{"$f":"VLOOKUP(D151,'Sheriffdom Look up'!$A$1:$E$102,5,FALSE)","v":"South Strathclyde, Dumfries & Galloway"},"2019/20","Q2",9875,"STRANRAER","S",12,11,7,3,4,2,2,0,0,12,118,116,11,78,53,16,2,66,91]
[{"$f":"VLOOKUP(D152,'Sheriffdom Look up'!$A$1:$E$102,5,FALSE)","v":"Grampian, Highland & Islands"},"2019/20","Q2",9881,"TAIN","S",15,0,0,0,0,0,0,0,0,0,106,104,24,144,65,3,2,72,92]
[{"$f":"VLOOKUP(D153,'Sheriffdom Look up'!$A$1:$E$102,5,FALSE)","v":"Grampian, Highland & Islands"},"2019/20","Q2",9891,"WICK","S",5,4,2,7,2,1,1,0,3,1,89,84,16,56,24,9,0,26,84]
[{"$f":"VLOOKUP(D154,'Sheriffdom Look up'!$A$1:$E$102,5,FALSE)","v":"National JP"},"2019/20","Q3",1,"NATIONAL","J",0,0,0,0,0,0,0,0,0,0,7965,8000,4625,4356,2460,407,83,3300,7782]
[{"$f":"VLOOKUP(D155,'Sheriffdom Look up'!$A$1:$E$102,5,FALSE)","v":"National SC"},"2019/20","Q3",0,"NATIONAL","S",2492,1438,1188,720,283,749,292,14,482,1315,16138,15292,3593,17738,9986,1747,293,13832,14419]
[{"$f":"VLOOKUP(D156,'Sheriffdom Look up'!$A$1:$E$102,5,FALSE)","v":"Tayside, Central & Fife"},"2019/20","Q3",9240,"ALLOA","J",0,0,0,0,0,0,0,0,0,0,50,50,32,28,19,6,1,13,56]
[{"$f":"VLOOKUP(D157,'Sheriffdom Look up'!$A$1:$E$102,5,FALSE)","v":"South Strathclyde, Dumfries & Galloway"},"2019/20","Q3",9246,"DUMFRIES","J",0,0,0,0,0,0,0,0,0,0,492,527,286,119,57,13,1,136,472]
[{"$f":"VLOOKUP(D158,'Sheriffdom Look up'!$A$1:$E$102,5,FALSE)","v":"South Strathclyde, Dumfries & Galloway"},"2019/20","Q3",9250,"STRANRAER","J",0,0,0,0,0,0,0,0,0,0,239,199,81,38,32,6,6,25,190]
[{"$f":"VLOOKUP(D159,'Sheriffdom Look up'!$A$1:$E$102,5,FALSE)","v":"Grampian, Highland & Islands"},"2019/20","Q3",9251,"ABERDEEN","J",0,0,0,0,0,0,0,0,0,0,887,868,415,313,120,30,11,231,868]
[{"$f":"VLOOKUP(D160,'Sheriffdom Look up'!$A$1:$E$102,5,FALSE)","v":"Grampian, Highland & Islands"},"2019/20","Q3",9252,"BANFF","J",0,0,0,0,0,0,0,0,0,0,18,29,10,21,14,4,0,21,33]
[{"$f":"VLOOKUP(D161,'Sheriffdom Look up'!$A$1:$E$102,5,FALSE)","v":"Grampian, Highland & Islands"},"2019/20","Q3",9253,"PETERHEAD","J",0,0,0,0,0,0,0,0,0,0,127,95,66,71,29,7,5,52,97]
[{"$f":"VLOOKUP(D162,'Sheriffdom Look up'!$A$1:$E$102,5,FALSE)","v":"Tayside, Central & Fife"},"2019/20","Q3",9256,"DUNDEE","J",0,0,0,0,0,0,0,0,0,0,407,365,283,148,46,8,0,103,280]
[{"$f":"VLOOKUP(D163,'Sheriffdom Look up'!$A$1:$E$102,5,FALSE)","v":"North Strathclyde"},"2019/20","Q3",9261,"KILMARNOCK","J",0,0,0,0,0,0,0,0,0,0,217,233,99,120,63,15,0,119,221]
[{"$f":"VLOOKUP(D164,'Sheriffdom Look up'!$A$1:$E$102,5,FALSE)","v":"Tayside, Central & Fife"},"2019/20","Q3",9264,"FORFAR","J",0,0,0,0,0,0,0,0,0,0,123,141,66,47,27,7,0,19,160]
[{"$f":"VLOOKUP(D165,'Sheriffdom Look up'!$A$1:$E$102,5,FALSE)","v":"Lothian & Borders"},"2019/20","Q3",9278,"EDINBURGH","J",0,0,0,0,0,0,0,0,0,0,874,859,626,589,254,30,11,432,787]
[{"$f":"VLOOKUP(D166,'Sheriffdom Look up'!$A$1:$E$102,5,FALSE)","v":"Tayside, Central & Fife"},"2019/20","Q3",9282,"FALKIRK","J",0,0,0,0,0,0,0,0,0,0,155,144,88,94,41,7,0,60,144]
[{"$f":"VLOOKUP(D167,'Sheriffdom Look up'!$A$1:$E$102,5,FALSE)","v":"Tayside, Central & Fife"},"2019/20","Q3",9286,"DUNFERMLINE","J",0,0,0,0,0,0,0,0,0,0,222,180,99,65,18,3,0,45,154]
[{"$f":"VLOOKUP(D168,'Sheriffdom Look up'!$A$1:$E$102,5,FALSE)","v":"Tayside, Central & Fife"},"2019/20","Q3",9287,"KIRKCALDY","J",0,0,0,0,0,0,0,0,0,0,294,260,198,121,59,13,0,123,217]
[{"$f":"VLOOKUP(D169,'Sheriffdom Look up'!$A$1:$E$102,5,FALSE)","v":"North Strathclyde"},"2019/20","Q3",9289,"CAMPBELTOWN","J",0,0,0,0,0,0,0,0,0,0,16,8,0,4,2,0,0,1,6]
[{"$f":"VLOOKUP(D170,'Sheriffdom Look up'!$A$1:$E$102,5,FALSE)","v":"North Strathclyde"},"2019/20","Q3",9290,"DUNOON","J",0,0,0,0,0,0,0,0,0,0,37,37,27,9,8,3,0,11,34]
[{"$f":"VLOOKUP(D171,'Sheriffdom Look up'!$A$1:$E$102,5,FALSE)","v":"North Strathclyde"},"2019/20","Q3",9292,"LOCHGILPHEAD","J",0,0,0,0,0,0,0,0,0,0,13,11,6,8,14,2,0,1,19]
[{"$f":"VLOOKUP(D172,'Sheriffdom Look up'!$A$1:$E$102,5,FALSE)","v":"North Strathclyde"},"2019/20","Q3",9293,"OBAN","J",0,0,0,0,0,0,0,0,0,0,19,19,7,3,5,3,0,4,18]
[{"$f":"VLOOKUP(D173,'Sheriffdom Look up'!$A$1:$E$102,5,FALSE)","v":"Glasgow & Strathkelvin"},"2019/20","Q3",9295,"GLASGOW","J",0,0,0,0,0,0,0,0,0,0,1126,1192,468,732,760,89,8,748,1281]
[{"$f":"VLOOKUP(D174,'Sheriffdom Look up'!$A$1:$E$102,5,FALSE)","v":"North Strathclyde"},"2019/20","Q3",9340,"GREENOCK","J",0,0,0,0,0,0,0,0,0,0,74,67,54,69,56,7,3,65,67]
[{"$f":"VLOOKUP(D175,'Sheriffdom Look up'!$A$1:$E$102,5,FALSE)","v":"Grampian, Highland & Islands"},"2019/20","Q3",9341,"ELGIN","J",0,0,0,0,0,0,0,0,0,0,82,75,54,66,35,8,1,61,82]
[{"$f":"VLOOKUP(D176,'Sheriffdom Look up'!$A$1:$E$102,5,FALSE)","v":"North Strathclyde"},"2019/20","Q3",9342,"PAISLEY","J",0,0,0,0,0,0,0,0,0,0,278,282,204,258,143,27,12,167,269]
[{"$f":"VLOOKUP(D177,'Sheriffdom Look up'!$A$1:$E$102,5,FALSE)","v":"Grampian, Highland & Islands"},"2019/20","Q3",9345,"FORT WILLIAM","J",0,0,0,0,0,0,0,0,0,0,50,69,37,20,11,2,0,12,76]
[{"$f":"VLOOKUP(D178,'Sheriffdom Look up'!$A$1:$E$102,5,FALSE)","v":"Grampian, Highland & Islands"},"2019/20","Q3",9346,"INVERNESS","J",0,0,0,0,0,0,0,0,0,0,252,262,206,168,64,11,1,110,273]
[{"$f":"VLOOKUP(D179,'Sheriffdom Look up'!$A$1:$E$102,5,FALSE)","v":"Grampian, Highland & Islands"},"2019/20","Q3",9348,"TAIN","J",0,0,0,0,0,0,0,0,0,0,32,49,30,40,14,1,0,35,58]
[{"$f":"VLOOKUP(D180,'Sheriffdom Look up'!$A$1:$E$102,5,FALSE)","v":"Lothian & Borders"},"2019/20","Q3",9351,"JEDBURGH","J",0,0,0,0,0,0,0,0,0,0,33,43,12,7,5,1,0,5,42]
[{"$f":"VLOOKUP(D181,'Sheriffdom Look up'!$A$1:$E$102,5,FALSE)","v":"Lothian & Borders"},"2019/20","Q3",9353,"SELKIRK","J",0,0,0,0,0,0,0,0,0,0,74,116,35,15,7,1,0,13,117]
[{"$f":"VLOOKUP(D182,'Sheriffdom Look up'!$A$1:$E$102,5,FALSE)","v":"South Strathclyde, Dumfries & Galloway"},"2019/20","Q3",9355,"AIRDRIE","J",0,0,0,0,0,0,0,0,0,0,210,209,155,167,85,20,0,106,203]
[{"$f":"VLOOKUP(D183,'Sheriffdom Look up'!$A$1:$E$102,5,FALSE)","v":"Tayside, Central & Fife"},"2019/20","Q3",9358,"PERTH","J",0,0,0,0,0,0,0,0,0,0,494,476,226,120,63,17,2,113,499]
[{"$f":"VLOOKUP(D184,'Sheriffdom Look up'!$A$1:$E$102,5,FALSE)","v":"South Strathclyde, Dumfries & Galloway"},"2019/20","Q3",9360,"AYR","J",0,0,0,0,0,0,0,0,0,0,167,186,116,118,36,7,1,60,169]
[{"$f":"VLOOKUP(D185,'Sheriffdom Look up'!$A$1:$E$102,5,FALSE)","v":"South Strathclyde, Dumfries & Galloway"},"2019/20","Q3",9366,"HAMILTON","J",0,0,0,0,0,0,0,0,0,0,381,331,163,432,227,36,17,196,337]
[{"$f":"VLOOKUP(D186,'Sheriffdom Look up'!$A$1:$E$102,5,FALSE)","v":"South Strathclyde, Dumfries & Galloway"},"2019/20","Q3",9367,"LANARK","J",0,0,0,0,0,0,0,0,0,0,78,92,58,65,29,8,0,25,102]
[{"$f":"VLOOKUP(D187,'Sheriffdom Look up'!$A$1:$E$102,5,FALSE)","v":"Tayside, Central & Fife"},"2019/20","Q3",9372,"STIRLING","J",0,0,0,0,0,0,0,0,0,0,102,101,85,55,30,2,3,52,87]
[{"$f":"VLOOKUP(D188,'Sheriffdom Look up'!$A$1:$E$102,5,FALSE)","v":"North Strathclyde"},"2019/20","Q3",9376,"DUMBARTON","J",0,0,0,0,0,0,0,0,0,0,153,210,151,120,53,8,0,90,171]
[{"$f":"VLOOKUP(D189,'Sheriffdom Look up'!$A$1:$E$102,5,FALSE)","v":"Lothian & Borders"},"2019/20","Q3",9380,"LIVINGSTON","J",0,0,0,0,0,0,0,0,0,0,189,215,182,106,34,5,0,46,193]
[{"$f":"VLOOKUP(D190,'Sheriffdom Look up'!$A$1:$E$102,5,FALSE)","v":"Grampian, Highland & Islands"},"2019/20","Q3",9701,"ABERDEEN","S",198,108,86,56,36,61,26,4,55,104,1065,978,247,1359,577,166,44,1067,949]
[{"$f":"VLOOKUP(D191,'Sheriffdom Look up'!$A$1:$E$102,5,FALSE)","v":"South Strathclyde, Dumfries & Galloway"},"2019/20","Q3",9702,"AIRDRIE","S",77,33,42,36,5,36,8,0,18,51,612,614,138,773,426,66,10,470,508]
[{"$f":"VLOOKUP(D192,'Sheriffdom Look up'!$A$1:$E$102,5,FALSE)","v":"Tayside, Central & Fife"},"2019/20","Q3",9703,"ALLOA","S",29,0,0,0,0,0,0,0,0,1,202,187,38,232,115,18,8,195,159]
[{"$f":"VLOOKUP(D193,'Sheriffdom Look up'!$A$1:$E$102,5,FALSE)","v":"South Strathclyde, Dumfries & Galloway"},"2019/20","Q3",9704,"AYR","S",65,37,45,26,5,17,3,0,14,36,584,567,117,563,240,58,0,355,497]
[{"$f":"VLOOKUP(D194,'Sheriffdom Look up'!$A$1:$E$102,5,FALSE)","v":"Grampian, Highland & Islands"},"2019/20","Q3",9711,"BANFF","S",2,0,0,0,0,0,0,0,0,0,46,43,10,70,43,11,7,62,37]
[{"$f":"VLOOKUP(D195,'Sheriffdom Look up'!$A$1:$E$102,5,FALSE)","v":"North Strathclyde"},"2019/20","Q3",9716,"CAMPBELTOWN","S",1,1,1,1,0,1,1,0,0,2,31,29,9,26,26,8,2,24,35]
[{"$f":"VLOOKUP(D196,'Sheriffdom Look up'!$A$1:$E$102,5,FALSE)","v":"North Strathclyde"},"2019/20","Q3",9723,"DUMBARTON","S",47,43,30,18,9,10,6,0,6,33,411,403,118,425,260,45,10,385,340]
[{"$f":"VLOOKUP(D197,'Sheriffdom Look up'!$A$1:$E$102,5,FALSE)","v":"South Strathclyde, Dumfries & Galloway"},"2019/20","Q3",9724,"DUMFRIES","S",35,26,27,9,9,10,4,0,7,26,362,358,78,286,169,53,0,254,350]
[{"$f":"VLOOKUP(D198,'Sheriffdom Look up'!$A$1:$E$102,5,FALSE)","v":"Tayside, Central & Fife"},"2019/20","Q3",9726,"DUNDEE","S",129,75,63,40,19,49,15,0,21,72,745,690,164,615,370,59,5,696,573]
[{"$f":"VLOOKUP(D199,'Sheriffdom Look up'!$A$1:$E$102,5,FALSE)","v":"Tayside, Central & Fife"},"2019/20","Q3",9727,"DUNFERMLINE","S",70,48,33,11,8,12,5,1,18,32,331,308,66,411,135,23,6,282,305]
[{"$f":"VLOOKUP(D200,'Sheriffdom Look up'!$A$1:$E$102,5,FALSE)","v":"North Strathclyde"},"2019/20","Q3",9728,"DUNOON","S",2,1,1,4,0,0,0,0,1,2,61,61,22,79,58,16,0,59,73]
[{"$f":"VLOOKUP(D201,'Sheriffdom Look up'!$A$1:$E$102,5,FALSE)","v":"Lothian & Borders"},"2019/20","Q3",9741,"EDINBURGH","S",351,215,208,129,46,104,30,4,54,206,2175,1908,603,2403,1250,130,11,2052,1759]
[{"$f":"VLOOKUP(D202,'Sheriffdom Look up'!$A$1:$E$102,5,FALSE)","v":"Grampian, Highland & Islands"},"2019/20","Q3",9742,"ELGIN","S",36,13,9,16,1,10,1,0,2,20,231,202,52,245,132,26,4,131,235]
[{"$f":"VLOOKUP(D203,'Sheriffdom Look up'!$A$1:$E$102,5,FALSE)","v":"Tayside, Central & Fife"},"2019/20","Q3",9751,"FALKIRK","S",58,47,37,15,13,17,5,0,15,39,577,540,129,538,323,36,12,417,507]
[{"$f":"VLOOKUP(D204,'Sheriffdom Look up'!$A$1:$E$102,5,FALSE)","v":"Tayside, Central & Fife"},"2019/20","Q3",9752,"FORFAR","S",39,0,0,0,0,0,0,0,0,0,246,250,40,262,149,8,1,213,226]
[{"$f":"VLOOKUP(D205,'Sheriffdom Look up'!$A$1:$E$102,5,FALSE)","v":"Grampian, Highland & Islands"},"2019/20","Q3",9753,"FORT WILLIAM","S",10,0,0,0,0,0,0,0,0,0,54,50,25,60,51,11,2,42,68]
[{"$f":"VLOOKUP(D206,'Sheriffdom Look up'!$A$1:$E$102,5,FALSE)","v":"Glasgow & Strathkelvin"},"2019/20","Q3",9761,"GLASGOW","S",493,322,223,69,46,172,68,0,113,258,2451,2541,316,2714,2179,307,27,2128,2507]
[{"$f":"VLOOKUP(D207,'Sheriffdom Look up'!$A$1:$E$102,5,FALSE)","v":"North Strathclyde"},"2019/20","Q3",9762,"GREENOCK","S",41,21,17,9,3,8,4,0,7,18,229,236,60,331,176,36,6,222,230]
[{"$f":"VLOOKUP(D208,'Sheriffdom Look up'!$A$1:$E$102,5,FALSE)","v":"South Strathclyde, Dumfries & Galloway"},"2019/20","Q3",9772,"HAMILTON","S",177,111,80,32,16,62,25,0,37,90,1076,991,122,1127,684,147,21,824,948]
[{"$f":"VLOOKUP(D209,'Sheriffdom Look up'!$A$1:$E$102,5,FALSE)","v":"Grampian, Highland & Islands"},"2019/20","Q3",9781,"INVERNESS","S",59,50,38,56,1,18,9,5,19,19,402,336,91,533,184,23,6,457,300]
[{"$f":"VLOOKUP(D210,'Sheriffdom Look up'!$A$1:$E$102,5,FALSE)","v":"Lothian & Borders"},"2019/20","Q3",9791,"JEDBURGH","S",22,8,5,13,1,2,2,0,3,4,127,115,17,116,70,13,6,95,94]
[{"$f":"VLOOKUP(D211,'Sheriffdom Look up'!$A$1:$E$102,5,FALSE)","v":"North Strathclyde"},"2019/20","Q3",9801,"KILMARNOCK","S",84,69,47,35,13,29,20,0,9,77,789,766,150,605,398,97,12,630,690]
[{"$f":"VLOOKUP(D212,'Sheriffdom Look up'!$A$1:$E$102,5,FALSE)","v":"Tayside, Central & Fife"},"2019/20","Q3",9803,"KIRKCALDY","S",86,40,28,21,16,25,12,0,12,46,560,501,159,739,398,89,16,445,585]
[{"$f":"VLOOKUP(D213,'Sheriffdom Look up'!$A$1:$E$102,5,FALSE)","v":"Grampian, Highland & Islands"},"2019/20","Q3",9805,"KIRKWALL","S",2,1,0,1,1,1,1,0,0,3,50,42,13,20,11,4,4,16,37]
[{"$f":"VLOOKUP(D214,'Sheriffdom Look up'!$A$1:$E$102,5,FALSE)","v":"South Strathclyde, Dumfries & Galloway"},"2019/20","Q3",9811,"LANARK","S",14,6,8,2,0,5,3,0,2,6,133,125,27,136,88,14,7,88,124]
[{"$f":"VLOOKUP(D215,'Sheriffdom Look up'!$A$1:$E$102,5,FALSE)","v":"Grampian, Highland & Islands"},"2019/20","Q3",9812,"LERWICK","S",8,5,4,1,1,4,2,0,0,6,66,63,48,53,10,2,0,40,54]
[{"$f":"VLOOKUP(D216,'Sheriffdom Look up'!$A$1:$E$102,5,FALSE)","v":"Grampian, Highland & Islands"},"2019/20","Q3",9814,"LOCHMADDY","S",0,0,0,0,0,0,0,0,0,0,2,3,1,4,2,0,0,6,3]
[{"$f":"VLOOKUP(D217,'Sheriffdom Look up'!$A$1:$E$102,5,FALSE)","v":"Lothian & Borders"},"2019/20","Q3",9815,"LIVINGSTON","S",75,30,33,19,9,15,6,0,12,31,402,386,217,578,211,25,15,375,363]
[{"$f":"VLOOKUP(D218,'Sheriffdom Look up'!$A$1:$E$102,5,FALSE)","v":"North Strathclyde"},"2019/20","Q3",9841,"OBAN","S",5,1,5,8,2,2,1,0,2,3,66,64,13,57,32,5,0,49,55]
[{"$f":"VLOOKUP(D219,'Sheriffdom Look up'!$A$1:$E$102,5,FALSE)","v":"North Strathclyde"},"2019/20","Q3",9851,"PAISLEY","S",105,35,46,39,6,35,10,0,25,44,684,677,168,853,511,89,24,658,550]
[{"$f":"VLOOKUP(D220,'Sheriffdom Look up'!$A$1:$E$102,5,FALSE)","v":"Tayside, Central & Fife"},"2019/20","Q3",9853,"PERTH","S",50,34,21,9,9,18,11,0,12,32,350,325,67,483,219,61,11,373,350]
[{"$f":"VLOOKUP(D221,'Sheriffdom Look up'!$A$1:$E$102,5,FALSE)","v":"Grampian, Highland & Islands"},"2019/20","Q3",9854,"PETERHEAD","S",46,0,0,0,0,0,0,0,0,0,231,196,41,231,101,28,4,173,229]
[{"$f":"VLOOKUP(D222,'Sheriffdom Look up'!$A$1:$E$102,5,FALSE)","v":"Grampian, Highland & Islands"},"2019/20","Q3",9855,"PORTREE","S",3,0,1,1,0,0,0,0,0,0,47,38,18,19,11,3,0,24,30]
[{"$f":"VLOOKUP(D223,'Sheriffdom Look up'!$A$1:$E$102,5,FALSE)","v":"Lothian & Borders"},"2019/20","Q3",9871,"SELKIRK","S",15,8,9,9,3,3,2,0,0,10,131,132,33,168,80,11,2,108,136]
[{"$f":"VLOOKUP(D224,'Sheriffdom Look up'!$A$1:$E$102,5,FALSE)","v":"Tayside, Central & Fife"},"2019/20","Q3",9872,"STIRLING","S",26,36,37,16,3,17,10,0,16,32,252,231,88,317,152,22,9,217,203]
[{"$f":"VLOOKUP(D225,'Sheriffdom Look up'!$A$1:$E$102,5,FALSE)","v":"Grampian, Highland & Islands"},"2019/20","Q3",9874,"STORNOWAY","S",5,1,2,11,0,2,0,0,1,2,62,72,26,53,21,3,0,22,75]
[{"$f":"VLOOKUP(D226,'Sheriffdom Look up'!$A$1:$E$102,5,FALSE)","v":"South Strathclyde, Dumfries & Galloway"},"2019/20","Q3",9875,"STRANRAER","S",13,11,2,5,2,2,1,0,1,6,114,105,19,90,65,19,1,72,95]
[{"$f":"VLOOKUP(D227,'Sheriffdom Look up'!$A$1:$E$102,5,FALSE)","v":"Grampian, Highland & Islands"},"2019/20","Q3",9881,"TAIN","S",6,0,0,0,0,0,0,0,0,0,73,64,18,108,41,12,0,77,62]
[{"$f":"VLOOKUP(D228,'Sheriffdom Look up'!$A$1:$E$102,5,FALSE)","v":"Grampian, Highland & Islands"},"2019/20","Q3",9891,"WICK","S",8,2,0,3,0,2,1,0,0,4,108,95,25,56,18,3,0,29,78]
[{"$f":"VLOOKUP(D229,'Sheriffdom Look up'!$A$1:$E$102,5,FALSE)","v":"National JP"},"2019/20","Q4",1,"NATIONAL","J",0,0,0,0,0,0,0,0,0,0,9787,9569,4559,4638,2493,336,51,3497,8030]
[{"$f":"VLOOKUP(D230,'Sheriffdom Look up'!$A$1:$E$102,5,FALSE)","v":"National SC"},"2019/20","Q4",0,"NATIONAL","S",2280,1302,1397,771,241,766,252,15,497,1221,16647,15555,4056,19075,11138,1633,305,13971,14198]
[{"$f":"VLOOKUP(D231,'Sheriffdom Look up'!$A$1:$E$102,5,FALSE)","v":"Tayside, Central & Fife"},"2019/20","Q4",9240,"ALLOA","J",0,0,0,0,0,0,0,0,0,0,62,62,37,28,12,0,0,15,52]
[{"$f":"VLOOKUP(D232,'Sheriffdom Look up'!$A$1:$E$102,5,FALSE)","v":"South Strathclyde, Dumfries & Galloway"},"2019/20","Q4",9246,"DUMFRIES","J",0,0,0,0,0,0,0,0,0,0,558,559,289,125,67,16,0,144,478]
[{"$f":"VLOOKUP(D233,'Sheriffdom Look up'!$A$1:$E$102,5,FALSE)","v":"South Strathclyde, Dumfries & Galloway"},"2019/20","Q4",9250,"STRANRAER","J",0,0,0,0,0,0,0,0,0,0,164,199,89,44,21,4,0,27,162]
[{"$f":"VLOOKUP(D234,'Sheriffdom Look up'!$A$1:$E$102,5,FALSE)","v":"Grampian, Highland & Islands"},"2019/20","Q4",9251,"ABERDEEN","J",0,0,0,0,0,0,0,0,0,0,951,951,337,308,143,25,8,268,845]
[{"$f":"VLOOKUP(D235,'Sheriffdom Look up'!$A$1:$E$102,5,FALSE)","v":"Grampian, Highland & Islands"},"2019/20","Q4",9252,"BANFF","J",0,0,0,0,0,0,0,0,0,0,31,31,12,17,17,3,0,15,36]
[{"$f":"VLOOKUP(D236,'Sheriffdom Look up'!$A$1:$E$102,5,FALSE)","v":"Grampian, Highland & Islands"},"2019/20","Q4",9253,"PETERHEAD","J",0,0,0,0,0,0,0,0,0,0,112,104,53,88,33,7,2,42,117]
[{"$f":"VLOOKUP(D237,'Sheriffdom Look up'!$A$1:$E$102,5,FALSE)","v":"Tayside, Central & Fife"},"2019/20","Q4",9256,"DUNDEE","J",0,0,0,0,0,0,0,0,0,0,308,371,326,167,59,4,0,102,310]
[{"$f":"VLOOKUP(D238,'Sheriffdom Look up'!$A$1:$E$102,5,FALSE)","v":"North Strathclyde"},"2019/20","Q4",9261,"KILMARNOCK","J",0,0,0,0,0,0,0,0,0,0,332,314,112,134,68,9,1,121,253]
[{"$f":"VLOOKUP(D239,'Sheriffdom Look up'!$A$1:$E$102,5,FALSE)","v":"Tayside, Central & Fife"},"2019/20","Q4",9264,"FORFAR","J",0,0,0,0,0,0,0,0,0,0,183,220,53,34,7,1,0,40,148]
[{"$f":"VLOOKUP(D240,'Sheriffdom Look up'!$A$1:$E$102,5,FALSE)","v":"Lothian & Borders"},"2019/20","Q4",9278,"EDINBURGH","J",0,0,0,0,0,0,0,0,0,0,1115,1043,625,674,327,22,7,414,909]
[{"$f":"VLOOKUP(D241,'Sheriffdom Look up'!$A$1:$E$102,5,FALSE)","v":"Tayside, Central & Fife"},"2019/20","Q4",9282,"FALKIRK","J",0,0,0,0,0,0,0,0,0,0,161,170,123,96,45,7,0,58,153]
[{"$f":"VLOOKUP(D242,'Sheriffdom Look up'!$A$1:$E$102,5,FALSE)","v":"Tayside, Central & Fife"},"2019/20","Q4",9286,"DUNFERMLINE","J",0,0,0,0,0,0,0,0,0,0,179,220,136,143,44,4,0,60,160]
[{"$f":"VLOOKUP(D243,'Sheriffdom Look up'!$A$1:$E$102,5,FALSE)","v":"Tayside, Central & Fife"},"2019/20","Q4",9287,"KIRKCALDY","J",0,0,0,0,0,0,0,0,0,0,309,318,166,196,78,13,0,112,261]
[{"$f":"VLOOKUP(D244,'Sheriffdom Look up'!$A$1:$E$102,5,FALSE)","v":"North Strathclyde"},"2019/20","Q4",9289,"CAMPBELTOWN","J",0,0,0,0,0,0,0,0,0,0,7,12,7,3,1,0,0,2,12]
[{"$f":"VLOOKUP(D245,'Sheriffdom Look up'!$A$1:$E$102,5,FALSE)","v":"North Strathclyde"},"2019/20","Q4",9290,"DUNOON","J",0,0,0,0,0,0,0,0,0,0,16,16,6,13,7,1,0,6,9]
[{"$f":"VLOOKUP(D246,'Sheriffdom Look up'!$A$1:$E$102,5,FALSE)","v":"North Strathclyde"},"2019/20","Q4",9292,"LOCHGILPHEAD","J",0,0,0,0,0,0,0,0,0,0,3,4,7,3,2,0,0,2,4]
[{"$f":"VLOOKUP(D247,'Sheriffdom Look up'!$A$1:$E$102,5,FALSE)","v":"North Strathclyde"},"2019/20","Q4",9293,"OBAN","J",0,0,0,0,0,0,0,0,0,0,19,16,7,8,3,0,0,5,14]
[{"$f":"VLOOKUP(D248,'Sheriffdom Look up'!$A$1:$E$102,5,FALSE)","v":"Glasgow & Strathkelvin"},"2019/20","Q4",9295,"GLASGOW","J",0,0,0,0,0,0,0,0,0,0,1979,1778,457,778,731,94,15,773,1373]
[{"$f":"VLOOKUP(D249,'Sheriffdom Look up'!$A$1:$E$102,5,FALSE)","v":"North Strathclyde"},"2019/20","Q4",9340,"GREENOCK","J",0,0,0,0,0,0,0,0,0,0,86,100,60,70,51,5,0,61,95]
[{"$f":"VLOOKUP(D250,'Sheriffdom Look up'!$A$1:$E$102,5,FALSE)","v":"Grampian, Highland & Islands"},"2019/20","Q4",9341,"ELGIN","J",0,0,0,0,0,0,0,0,0,0,145,102,68,84,35,6,0,72,86]
[{"$f":"VLOOKUP(D251,'Sheriffdom Look up'!$A$1:$E$102,5,FALSE)","v":"North Strathclyde"},"2019/20","Q4",9342,"PAISLEY","J",0,0,0,0,0,0,0,0,0,0,367,349,179,208,136,18,3,179,298]
[{"$f":"VLOOKUP(D252,'Sheriffdom Look up'!$A$1:$E$102,5,FALSE)","v":"Grampian, Highland & Islands"},"2019/20","Q4",9345,"FORT WILLIAM","J",0,0,0,0,0,0,0,0,0,0,77,80,24,14,9,2,1,14,64]
[{"$f":"VLOOKUP(D253,'Sheriffdom Look up'!$A$1:$E$102,5,FALSE)","v":"Grampian, Highland & Islands"},"2019/20","Q4",9346,"INVERNESS","J",0,0,0,0,0,0,0,0,0,0,294,327,172,167,47,10,0,137,278]
[{"$f":"VLOOKUP(D254,'Sheriffdom Look up'!$A$1:$E$102,5,FALSE)","v":"Grampian, Highland & Islands"},"2019/20","Q4",9348,"TAIN","J",0,0,0,0,0,0,0,0,0,0,68,79,42,38,18,0,0,35,59]
[{"$f":"VLOOKUP(D255,'Sheriffdom Look up'!$A$1:$E$102,5,FALSE)","v":"Lothian & Borders"},"2019/20","Q4",9351,"JEDBURGH","J",0,0,0,0,0,0,0,0,0,0,60,47,20,8,7,2,1,7,36]
[{"$f":"VLOOKUP(D256,'Sheriffdom Look up'!$A$1:$E$102,5,FALSE)","v":"Lothian & Borders"},"2019/20","Q4",9353,"SELKIRK","J",0,0,0,0,0,0,0,0,0,0,119,72,14,17,8,2,0,7,72]
[{"$f":"VLOOKUP(D257,'Sheriffdom Look up'!$A$1:$E$102,5,FALSE)","v":"South Strathclyde, Dumfries & Galloway"},"2019/20","Q4",9355,"AIRDRIE","J",0,0,0,0,0,0,0,0,0,0,267,241,130,191,93,12,2,125,170]
[{"$f":"VLOOKUP(D258,'Sheriffdom Look up'!$A$1:$E$102,5,FALSE)","v":"Tayside, Central & Fife"},"2019/20","Q4",9358,"PERTH","J",0,0,0,0,0,0,0,0,0,0,536,541,170,124,66,10,2,110,482]
[{"$f":"VLOOKUP(D259,'Sheriffdom Look up'!$A$1:$E$102,5,FALSE)","v":"South Strathclyde, Dumfries & Galloway"},"2019/20","Q4",9360,"AYR","J",0,0,0,0,0,0,0,0,0,0,188,196,153,121,53,19,0,71,163]
[{"$f":"VLOOKUP(D260,'Sheriffdom Look up'!$A$1:$E$102,5,FALSE)","v":"South Strathclyde, Dumfries & Galloway"},"2019/20","Q4",9366,"HAMILTON","J",0,0,0,0,0,0,0,0,0,0,421,392,226,346,164,27,6,213,374]
[{"$f":"VLOOKUP(D261,'Sheriffdom Look up'!$A$1:$E$102,5,FALSE)","v":"South Strathclyde, Dumfries & Galloway"},"2019/20","Q4",9367,"LANARK","J",0,0,0,0,0,0,0,0,0,0,73,73,43,50,23,2,0,25,70]
[{"$f":"VLOOKUP(D262,'Sheriffdom Look up'!$A$1:$E$102,5,FALSE)","v":"Tayside, Central & Fife"},"2019/20","Q4",9372,"STIRLING","J",0,0,0,0,0,0,0,0,0,0,135,130,93,83,43,7,3,57,95]
[{"$f":"VLOOKUP(D263,'Sheriffdom Look up'!$A$1:$E$102,5,FALSE)","v":"North Strathclyde"},"2019/20","Q4",9376,"DUMBARTON","J",0,0,0,0,0,0,0,0,0,0,206,225,153,140,53,3,0,118,199]
[{"$f":"VLOOKUP(D264,'Sheriffdom Look up'!$A$1:$E$102,5,FALSE)","v":"Lothian & Borders"},"2019/20","Q4",9380,"LIVINGSTON","J",0,0,0,0,0,0,0,0,0,0,256,227,170,118,22,1,0,60,193]
[{"$f":"VLOOKUP(D265,'Sheriffdom Look up'!$A$1:$E$102,5,FALSE)","v":"Grampian, Highland & Islands"},"2019/20","Q4",9701,"ABERDEEN","S",162,140,119,74,29,55,22,3,68,100,1140,1011,268,1345,699,152,52,1200,924]
[{"$f":"VLOOKUP(D266,'Sheriffdom Look up'!$A$1:$E$102,5,FALSE)","v":"South Strathclyde, Dumfries & Galloway"},"2019/20","Q4",9702,"AIRDRIE","S",51,43,64,32,4,30,9,0,21,44,612,544,137,625,436,80,4,457,489]
[{"$f":"VLOOKUP(D267,'Sheriffdom Look up'!$A$1:$E$102,5,FALSE)","v":"Tayside, Central & Fife"},"2019/20","Q4",9703,"ALLOA","S",25,0,0,0,0,0,0,0,0,1,234,222,64,313,155,16,16,195,216]
[{"$f":"VLOOKUP(D268,'Sheriffdom Look up'!$A$1:$E$102,5,FALSE)","v":"South Strathclyde, Dumfries & Galloway"},"2019/20","Q4",9704,"AYR","S",59,28,41,24,3,17,8,0,17,45,476,448,153,562,265,37,0,337,445]
[{"$f":"VLOOKUP(D269,'Sheriffdom Look up'!$A$1:$E$102,5,FALSE)","v":"Grampian, Highland & Islands"},"2019/20","Q4",9711,"BANFF","S",2,0,0,0,0,0,0,0,0,0,42,34,14,65,48,13,6,60,40]
[{"$f":"VLOOKUP(D270,'Sheriffdom Look up'!$A$1:$E$102,5,FALSE)","v":"North Strathclyde"},"2019/20","Q4",9716,"CAMPBELTOWN","S",0,0,0,1,0,1,0,0,1,1,29,29,12,33,31,8,0,19,34]
[{"$f":"VLOOKUP(D271,'Sheriffdom Look up'!$A$1:$E$102,5,FALSE)","v":"North Strathclyde"},"2019/20","Q4",9723,"DUMBARTON","S",46,32,31,29,6,12,5,0,6,26,403,414,100,468,277,43,8,404,368]
[{"$f":"VLOOKUP(D272,'Sheriffdom Look up'!$A$1:$E$102,5,FALSE)","v":"South Strathclyde, Dumfries & Galloway"},"2019/20","Q4",9724,"DUMFRIES","S",35,29,18,5,9,14,9,0,1,24,412,418,108,274,200,48,0,271,366]
[{"$f":"VLOOKUP(D273,'Sheriffdom Look up'!$A$1:$E$102,5,FALSE)","v":"Tayside, Central & Fife"},"2019/20","Q4",9726,"DUNDEE","S",123,82,67,32,29,36,16,0,38,82,717,667,282,651,344,33,3,698,607]
[{"$f":"VLOOKUP(D274,'Sheriffdom Look up'!$A$1:$E$102,5,FALSE)","v":"Tayside, Central & Fife"},"2019/20","Q4",9727,"DUNFERMLINE","S",49,27,42,19,5,18,4,2,22,29,423,413,121,640,200,27,1,309,315]
[{"$f":"VLOOKUP(D275,'Sheriffdom Look up'!$A$1:$E$102,5,FALSE)","v":"North Strathclyde"},"2019/20","Q4",9728,"DUNOON","S",4,0,1,2,0,1,1,0,0,3,42,44,21,66,57,7,2,33,62]
[{"$f":"VLOOKUP(D276,'Sheriffdom Look up'!$A$1:$E$102,5,FALSE)","v":"Lothian & Borders"},"2019/20","Q4",9741,"EDINBURGH","S",325,166,180,165,24,104,23,3,55,160,2048,1811,601,2909,1612,137,18,1980,1809]
[{"$f":"VLOOKUP(D277,'Sheriffdom Look up'!$A$1:$E$102,5,FALSE)","v":"Grampian, Highland & Islands"},"2019/20","Q4",9742,"ELGIN","S",41,12,14,22,5,3,1,0,0,18,265,234,47,225,124,18,1,165,187]
[{"$f":"VLOOKUP(D278,'Sheriffdom Look up'!$A$1:$E$102,5,FALSE)","v":"Tayside, Central & Fife"},"2019/20","Q4",9751,"FALKIRK","S",70,43,37,10,12,22,7,0,13,40,524,555,104,636,466,53,15,360,551]
[{"$f":"VLOOKUP(D279,'Sheriffdom Look up'!$A$1:$E$102,5,FALSE)","v":"Tayside, Central & Fife"},"2019/20","Q4",9752,"FORFAR","S",38,0,0,0,0,0,0,0,0,1,280,256,44,328,165,18,2,257,201]
[{"$f":"VLOOKUP(D280,'Sheriffdom Look up'!$A$1:$E$102,5,FALSE)","v":"Grampian, Highland & Islands"},"2019/20","Q4",9753,"FORT WILLIAM","S",7,0,0,0,0,0,0,0,0,0,49,47,22,68,34,7,0,57,33]
[{"$f":"VLOOKUP(D281,'Sheriffdom Look up'!$A$1:$E$102,5,FALSE)","v":"Glasgow & Strathkelvin"},"2019/20","Q4",9761,"GLASGOW","S",450,317,294,79,29,171,49,0,116,205,2787,2639,354,2644,2119,264,23,2177,2300]
[{"$f":"VLOOKUP(D282,'Sheriffdom Look up'!$A$1:$E$102,5,FALSE)","v":"North Strathclyde"},"2019/20","Q4",9762,"GREENOCK","S",42,9,22,14,2,12,5,1,6,21,259,241,49,345,193,36,13,227,215]
[{"$f":"VLOOKUP(D283,'Sheriffdom Look up'!$A$1:$E$102,5,FALSE)","v":"South Strathclyde, Dumfries & Galloway"},"2019/20","Q4",9772,"HAMILTON","S",168,85,102,33,16,66,19,1,24,91,1066,893,143,1009,582,127,8,720,887]
[{"$f":"VLOOKUP(D284,'Sheriffdom Look up'!$A$1:$E$102,5,FALSE)","v":"Grampian, Highland & Islands"},"2019/20","Q4",9781,"INVERNESS","S",49,46,55,64,6,18,8,5,11,38,461,441,143,517,210,27,7,558,316]
[{"$f":"VLOOKUP(D285,'Sheriffdom Look up'!$A$1:$E$102,5,FALSE)","v":"Lothian & Borders"},"2019/20","Q4",9791,"JEDBURGH","S",15,5,7,5,2,6,2,0,2,7,102,104,17,163,129,15,8,112,99]
[{"$f":"VLOOKUP(D286,'Sheriffdom Look up'!$A$1:$E$102,5,FALSE)","v":"North Strathclyde"},"2019/20","Q4",9801,"KILMARNOCK","S",97,73,58,26,17,25,12,0,11,71,846,797,161,739,473,89,7,615,738]
[{"$f":"VLOOKUP(D287,'Sheriffdom Look up'!$A$1:$E$102,5,FALSE)","v":"Tayside, Central & Fife"},"2019/20","Q4",9803,"KIRKCALDY","S",76,33,36,11,16,28,13,0,14,38,720,691,239,685,389,76,10,452,541]
[{"$f":"VLOOKUP(D288,'Sheriffdom Look up'!$A$1:$E$102,5,FALSE)","v":"Grampian, Highland & Islands"},"2019/20","Q4",9805,"KIRKWALL","S",1,3,2,1,1,1,1,0,0,2,40,49,15,30,15,8,1,17,50]
[{"$f":"VLOOKUP(D289,'Sheriffdom Look up'!$A$1:$E$102,5,FALSE)","v":"South Strathclyde, Dumfries & Galloway"},"2019/20","Q4",9811,"LANARK","S",28,7,13,6,0,5,1,0,2,5,140,110,30,117,72,8,5,67,130]
[{"$f":"VLOOKUP(D290,'Sheriffdom Look up'!$A$1:$E$102,5,FALSE)","v":"Grampian, Highland & Islands"},"2019/20","Q4",9812,"LERWICK","S",4,4,4,1,1,0,0,0,1,5,55,47,35,41,19,2,0,22,68]
[{"$f":"VLOOKUP(D291,'Sheriffdom Look up'!$A$1:$E$102,5,FALSE)","v":"Grampian, Highland & Islands"},"2019/20","Q4",9814,"LOCHMADDY","S",0,0,0,0,0,0,0,0,0,0,11,11,1,8,8,1,0,7,9]
[{"$f":"VLOOKUP(D292,'Sheriffdom Look up'!$A$1:$E$102,5,FALSE)","v":"Lothian & Borders"},"2019/20","Q4",9815,"LIVINGSTON","S",62,28,40,24,3,17,3,0,9,30,432,391,190,921,286,23,11,448,308]
[{"$f":"VLOOKUP(D293,'Sheriffdom Look up'!$A$1:$E$102,5,FALSE)","v":"North Strathclyde"},"2019/20","Q4",9841,"OBAN","S",3,3,3,0,0,2,2,0,0,3,59,67,10,79,60,9,3,49,76]
[{"$f":"VLOOKUP(D294,'Sheriffdom Look up'!$A$1:$E$102,5,FALSE)","v":"North Strathclyde"},"2019/20","Q4",9851,"PAISLEY","S",85,23,64,39,9,47,15,0,19,54,578,584,176,952,613,86,49,567,577]
[{"$f":"VLOOKUP(D295,'Sheriffdom Look up'!$A$1:$E$102,5,FALSE)","v":"Tayside, Central & Fife"},"2019/20","Q4",9853,"PERTH","S",50,27,26,9,6,23,9,0,13,34,430,405,122,575,252,69,11,398,354]
[{"$f":"VLOOKUP(D296,'Sheriffdom Look up'!$A$1:$E$102,5,FALSE)","v":"Grampian, Highland & Islands"},"2019/20","Q4",9854,"PETERHEAD","S",37,0,0,0,0,0,0,0,0,0,262,236,56,204,128,31,13,180,213]
[{"$f":"VLOOKUP(D297,'Sheriffdom Look up'!$A$1:$E$102,5,FALSE)","v":"Grampian, Highland & Islands"},"2019/20","Q4",9855,"PORTREE","S",1,1,1,2,0,0,0,0,0,0,38,40,13,22,17,4,3,26,35]
[{"$f":"VLOOKUP(D298,'Sheriffdom Look up'!$A$1:$E$102,5,FALSE)","v":"Lothian & Borders"},"2019/20","Q4",9871,"SELKIRK","S",15,8,5,7,1,2,0,0,7,4,104,101,14,132,89,10,1,97,118]
[{"$f":"VLOOKUP(D299,'Sheriffdom Look up'!$A$1:$E$102,5,FALSE)","v":"Tayside, Central & Fife"},"2019/20","Q4",9872,"STIRLING","S",30,22,41,20,2,25,4,0,17,28,216,226,95,350,176,22,1,201,216]
[{"$f":"VLOOKUP(D300,'Sheriffdom Look up'!$A$1:$E$102,5,FALSE)","v":"Grampian, Highland & Islands"},"2019/20","Q4",9874,"STORNOWAY","S",3,1,0,5,0,1,1,0,0,1,65,62,32,44,25,3,2,32,42]
[{"$f":"VLOOKUP(D301,'Sheriffdom Look up'!$A$1:$E$102,5,FALSE)","v":"South Strathclyde, Dumfries & Galloway"},"2019/20","Q4",9875,"STRANRAER","S",9,3,7,5,4,4,3,0,3,7,105,102,22,101,83,19,1,87,90]
[{"$f":"VLOOKUP(D302,'Sheriffdom Look up'!$A$1:$E$102,5,FALSE)","v":"Grampian, Highland & Islands"},"2019/20","Q4",9881,"TAIN","S",13,0,0,0,0,0,0,0,0,0,89,81,17,116,55,7,0,75,85]
[{"$f":"VLOOKUP(D303,'Sheriffdom Look up'!$A$1:$E$102,5,FALSE)","v":"Grampian, Highland & Islands"},"2019/20","Q4",9891,"WICK","S",5,2,3,5,0,0,0,0,0,3,86,90,24,73,32,0,0,35,84]
[{"$f":"VLOOKUP(D304,'Sheriffdom Look up'!$A$1:$E$102,5,FALSE)","v":"National JP"},"2020/21","Q1",1,"NATIONAL","J",0,0,0,0,0,0,0,0,0,0,3891,2492,2830,1252,204,0,0,3732,253]
[{"$f":"VLOOKUP(D305,'Sheriffdom Look up'!$A$1:$E$102,5,FALSE)","v":"National SC"},"2020/21","Q1",0,"NATIONAL","S",2517,893,767,371,175,155,0,0,497,433,10572,7757,3826,5333,1328,38,0,17818,2319]
[{"$f":"VLOOKUP(D306,'Sheriffdom Look up'!$A$1:$E$102,5,FALSE)","v":"Tayside, Central & Fife"},"2020/21","Q1",9240,"ALLOA","J",0,0,0,0,0,0,0,0,0,0,17,14,9,9,2,0,0,17,0]
[{"$f":"VLOOKUP(D307,'Sheriffdom Look up'!$A$1:$E$102,5,FALSE)","v":"South Strathclyde, Dumfries & Galloway"},"2020/21","Q1",9246,"DUMFRIES","J",0,0,0,0,0,0,0,0,0,0,225,21,67,41,8,0,0,139,12]
[{"$f":"VLOOKUP(D308,'Sheriffdom Look up'!$A$1:$E$102,5,FALSE)","v":"South Strathclyde, Dumfries & Galloway"},"2020/21","Q1",9250,"STRANRAER","J",0,0,0,0,0,0,0,0,0,0,44,0,22,4,1,0,0,28,0]
[{"$f":"VLOOKUP(D309,'Sheriffdom Look up'!$A$1:$E$102,5,FALSE)","v":"Grampian, Highland & Islands"},"2020/21","Q1",9251,"ABERDEEN","J",0,0,0,0,0,0,0,0,0,0,391,393,373,173,7,0,0,285,52]
[{"$f":"VLOOKUP(D310,'Sheriffdom Look up'!$A$1:$E$102,5,FALSE)","v":"Grampian, Highland & Islands"},"2020/21","Q1",9252,"BANFF","J",0,0,0,0,0,0,0,0,0,0,12,12,9,7,2,0,0,15,0]
[{"$f":"VLOOKUP(D311,'Sheriffdom Look up'!$A$1:$E$102,5,FALSE)","v":"Grampian, Highland & Islands"},"2020/21","Q1",9253,"PETERHEAD","J",0,0,0,0,0,0,0,0,0,0,63,63,44,25,6,0,0,49,7]
[{"$f":"VLOOKUP(D312,'Sheriffdom Look up'!$A$1:$E$102,5,FALSE)","v":"Tayside, Central & Fife"},"2020/21","Q1",9256,"DUNDEE","J",0,0,0,0,0,0,0,0,0,0,114,85,25,39,7,0,0,99,4]
[{"$f":"VLOOKUP(D313,'Sheriffdom Look up'!$A$1:$E$102,5,FALSE)","v":"North Strathclyde"},"2020/21","Q1",9261,"KILMARNOCK","J",0,0,0,0,0,0,0,0,0,0,139,119,427,92,15,0,0,159,24]
[{"$f":"VLOOKUP(D314,'Sheriffdom Look up'!$A$1:$E$102,5,FALSE)","v":"Tayside, Central & Fife"},"2020/21","Q1",9264,"FORFAR","J",0,0,0,0,0,0,0,0,0,0,87,80,46,25,1,0,0,39,1]
[{"$f":"VLOOKUP(D315,'Sheriffdom Look up'!$A$1:$E$102,5,FALSE)","v":"Lothian & Borders"},"2020/21","Q1",9278,"EDINBURGH","J",0,0,0,0,0,0,0,0,0,0,465,517,155,291,48,0,0,471,10]
[{"$f":"VLOOKUP(D316,'Sheriffdom Look up'!$A$1:$E$102,5,FALSE)","v":"Tayside, Central & Fife"},"2020/21","Q1",9282,"FALKIRK","J",0,0,0,0,0,0,0,0,0,0,69,93,26,43,6,0,0,77,2]
[{"$f":"VLOOKUP(D317,'Sheriffdom Look up'!$A$1:$E$102,5,FALSE)","v":"Tayside, Central & Fife"},"2020/21","Q1",9286,"DUNFERMLINE","J",0,0,0,0,0,0,0,0,0,0,79,73,70,1,0,0,0,66,1]
[{"$f":"VLOOKUP(D318,'Sheriffdom Look up'!$A$1:$E$102,5,FALSE)","v":"Tayside, Central & Fife"},"2020/21","Q1",9287,"KIRKCALDY","J",0,0,0,0,0,0,0,0,0,0,140,121,88,78,10,0,0,108,1]
[{"$f":"VLOOKUP(D319,'Sheriffdom Look up'!$A$1:$E$102,5,FALSE)","v":"North Strathclyde"},"2020/21","Q1",9289,"CAMPBELTOWN","J",0,0,0,0,0,0,0,0,0,0,8,7,2,0,0,0,0,1,0]
[{"$f":"VLOOKUP(D320,'Sheriffdom Look up'!$A$1:$E$102,5,FALSE)","v":"North Strathclyde"},"2020/21","Q1",9290,"DUNOON","J",0,0,0,0,0,0,0,0,0,0,14,6,16,0,0,0,0,13,0]
[{"$f":"VLOOKUP(D321,'Sheriffdom Look up'!$A$1:$E$102,5,FALSE)","v":"North Strathclyde"},"2020/21","Q1",9292,"LOCHGILPHEAD","J",0,0,0,0,0,0,0,0,0,0,3,3,4,1,0,0,0,1,1]
[{"$f":"VLOOKUP(D322,'Sheriffdom Look up'!$A$1:$E$102,5,FALSE)","v":"North Strathclyde"},"2020/21","Q1",9293,"OBAN","J",0,0,0,0,0,0,0,0,0,0,7,5,0,0,0,0,0,0,0]
[{"$f":"VLOOKUP(D323,'Sheriffdom Look up'!$A$1:$E$102,5,FALSE)","v":"Glasgow & Strathkelvin"},"2020/21","Q1",9295,"GLASGOW","J",0,0,0,0,0,0,0,0,0,0,819,13,0,4,1,0,0,807,10]
[{"$f":"VLOOKUP(D324,'Sheriffdom Look up'!$A$1:$E$102,5,FALSE)","v":"North Strathclyde"},"2020/21","Q1",9340,"GREENOCK","J",0,0,0,0,0,0,0,0,0,0,57,36,113,21,1,0,0,73,10]
[{"$f":"VLOOKUP(D325,'Sheriffdom Look up'!$A$1:$E$102,5,FALSE)","v":"Grampian, Highland & Islands"},"2020/21","Q1",9341,"ELGIN","J",0,0,0,0,0,0,0,0,0,0,58,97,54,49,14,0,0,71,14]
[{"$f":"VLOOKUP(D326,'Sheriffdom Look up'!$A$1:$E$102,5,FALSE)","v":"North Strathclyde"},"2020/21","Q1",9342,"PAISLEY","J",0,0,0,0,0,0,0,0,0,0,116,31,333,51,8,0,0,180,2]
[{"$f":"VLOOKUP(D327,'Sheriffdom Look up'!$A$1:$E$102,5,FALSE)","v":"Grampian, Highland & Islands"},"2020/21","Q1",9345,"FORT WILLIAM","J",0,0,0,0,0,0,0,0,0,0,28,14,10,7,1,0,0,14,0]
[{"$f":"VLOOKUP(D328,'Sheriffdom Look up'!$A$1:$E$102,5,FALSE)","v":"Grampian, Highland & Islands"},"2020/21","Q1",9346,"INVERNESS","J",0,0,0,0,0,0,0,0,0,0,152,22,70,17,3,0,0,141,10]
[{"$f":"VLOOKUP(D329,'Sheriffdom Look up'!$A$1:$E$102,5,FALSE)","v":"Grampian, Highland & Islands"},"2020/21","Q1",9348,"TAIN","J",0,0,0,0,0,0,0,0,0,0,38,14,30,26,4,0,0,35,0]
[{"$f":"VLOOKUP(D330,'Sheriffdom Look up'!$A$1:$E$102,5,FALSE)","v":"Lothian & Borders"},"2020/21","Q1",9351,"JEDBURGH","J",0,0,0,0,0,0,0,0,0,0,1,14,8,2,2,0,0,7,0]
[{"$f":"VLOOKUP(D331,'Sheriffdom Look up'!$A$1:$E$102,5,FALSE)","v":"Lothian & Borders"},"2020/21","Q1",9353,"SELKIRK","J",0,0,0,0,0,0,0,0,0,0,1,47,6,4,1,0,0,7,0]
[{"$f":"VLOOKUP(D332,'Sheriffdom Look up'!$A$1:$E$102,5,FALSE)","v":"South Strathclyde, Dumfries & Galloway"},"2020/21","Q1",9355,"AIRDRIE","J",0,0,0,0,0,0,0,0,0,0,44,36,103,3,12,0,0,135,0]
[{"$f":"VLOOKUP(D333,'Sheriffdom Look up'!$A$1:$E$102,5,FALSE)","v":"Tayside, Central & Fife"},"2020/21","Q1",9358,"PERTH","J",0,0,0,0,0,0,0,0,0,0,301,336,107,85,17,0,0,136,53]
[{"$f":"VLOOKUP(D334,'Sheriffdom Look up'!$A$1:$E$102,5,FALSE)","v":"South Strathclyde, Dumfries & Galloway"},"2020/21","Q1",9360,"AYR","J",0,0,0,0,0,0,0,0,0,0,34,19,77,15,3,0,0,75,2]
[{"$f":"VLOOKUP(D335,'Sheriffdom Look up'!$A$1:$E$102,5,FALSE)","v":"South Strathclyde, Dumfries & Galloway"},"2020/21","Q1",9366,"HAMILTON","J",0,0,0,0,0,0,0,0,0,0,81,10,78,35,3,0,0,227,26]
[{"$f":"VLOOKUP(D336,'Sheriffdom Look up'!$A$1:$E$102,5,FALSE)","v":"South Strathclyde, Dumfries & Galloway"},"2020/21","Q1",9367,"LANARK","J",0,0,0,0,0,0,0,0,0,0,31,3,28,20,0,0,0,26,1]
[{"$f":"VLOOKUP(D337,'Sheriffdom Look up'!$A$1:$E$102,5,FALSE)","v":"Tayside, Central & Fife"},"2020/21","Q1",9372,"STIRLING","J",0,0,0,0,0,0,0,0,0,0,26,11,186,38,3,0,0,55,2]
[{"$f":"VLOOKUP(D338,'Sheriffdom Look up'!$A$1:$E$102,5,FALSE)","v":"North Strathclyde"},"2020/21","Q1",9376,"DUMBARTON","J",0,0,0,0,0,0,0,0,0,0,109,78,188,24,6,0,0,114,7]
[{"$f":"VLOOKUP(D339,'Sheriffdom Look up'!$A$1:$E$102,5,FALSE)","v":"Lothian & Borders"},"2020/21","Q1",9380,"LIVINGSTON","J",0,0,0,0,0,0,0,0,0,0,118,99,56,22,12,0,0,62,1]
[{"$f":"VLOOKUP(D340,'Sheriffdom Look up'!$A$1:$E$102,5,FALSE)","v":"Grampian, Highland & Islands"},"2020/21","Q1",9701,"ABERDEEN","S",235,84,72,10,25,35,0,0,68,30,813,693,446,765,159,5,0,1348,230]
[{"$f":"VLOOKUP(D341,'Sheriffdom Look up'!$A$1:$E$102,5,FALSE)","v":"South Strathclyde, Dumfries & Galloway"},"2020/21","Q1",9702,"AIRDRIE","S",56,24,14,8,2,4,0,0,21,1,276,198,110,58,6,1,0,631,50]
[{"$f":"VLOOKUP(D342,'Sheriffdom Look up'!$A$1:$E$102,5,FALSE)","v":"Tayside, Central & Fife"},"2020/21","Q1",9703,"ALLOA","S",1,0,0,0,0,0,0,0,0,0,44,35,21,109,29,0,0,247,1]
[{"$f":"VLOOKUP(D343,'Sheriffdom Look up'!$A$1:$E$102,5,FALSE)","v":"South Strathclyde, Dumfries & Galloway"},"2020/21","Q1",9704,"AYR","S",8,6,8,16,2,0,0,0,17,8,126,80,105,87,5,0,0,456,6]
[{"$f":"VLOOKUP(D344,'Sheriffdom Look up'!$A$1:$E$102,5,FALSE)","v":"Grampian, Highland & Islands"},"2020/21","Q1",9711,"BANFF","S",1,0,0,0,0,0,0,0,0,0,26,24,42,26,11,1,0,72,3]
[{"$f":"VLOOKUP(D345,'Sheriffdom Look up'!$A$1:$E$102,5,FALSE)","v":"North Strathclyde"},"2020/21","Q1",9716,"CAMPBELTOWN","S",2,0,0,0,0,0,0,0,1,0,11,3,12,1,1,0,0,21,1]
[{"$f":"VLOOKUP(D346,'Sheriffdom Look up'!$A$1:$E$102,5,FALSE)","v":"North Strathclyde"},"2020/21","Q1",9723,"DUMBARTON","S",33,27,19,12,10,2,0,0,6,6,279,219,343,187,46,1,0,552,37]
[{"$f":"VLOOKUP(D347,'Sheriffdom Look up'!$A$1:$E$102,5,FALSE)","v":"South Strathclyde, Dumfries & Galloway"},"2020/21","Q1",9724,"DUMFRIES","S",44,15,6,9,8,0,0,0,1,13,253,206,56,100,37,0,0,306,70]
[{"$f":"VLOOKUP(D348,'Sheriffdom Look up'!$A$1:$E$102,5,FALSE)","v":"Tayside, Central & Fife"},"2020/21","Q1",9726,"DUNDEE","S",201,103,45,14,16,0,0,0,38,38,515,442,13,352,69,5,0,811,144]
[{"$f":"VLOOKUP(D349,'Sheriffdom Look up'!$A$1:$E$102,5,FALSE)","v":"Tayside, Central & Fife"},"2020/21","Q1",9727,"DUNFERMLINE","S",0,0,2,1,0,0,0,0,22,2,99,121,95,1,5,0,0,371,3]
[{"$f":"VLOOKUP(D350,'Sheriffdom Look up'!$A$1:$E$102,5,FALSE)","v":"North Strathclyde"},"2020/21","Q1",9728,"DUNOON","S",2,0,0,0,0,0,0,0,0,0,25,14,41,11,0,0,0,49,0]
[{"$f":"VLOOKUP(D351,'Sheriffdom Look up'!$A$1:$E$102,5,FALSE)","v":"Lothian & Borders"},"2020/21","Q1",9741,"EDINBURGH","S",405,74,96,44,21,4,0,0,55,55,1473,1373,321,1177,398,4,0,2595,269]
[{"$f":"VLOOKUP(D352,'Sheriffdom Look up'!$A$1:$E$102,5,FALSE)","v":"Grampian, Highland & Islands"},"2020/21","Q1",9742,"ELGIN","S",3,0,0,0,0,0,0,0,0,0,85,73,93,118,15,0,0,217,6]
[{"$f":"VLOOKUP(D353,'Sheriffdom Look up'!$A$1:$E$102,5,FALSE)","v":"Tayside, Central & Fife"},"2020/21","Q1",9751,"FALKIRK","S",191,64,32,23,5,6,0,0,13,27,603,509,29,175,48,0,0,570,177]
[{"$f":"VLOOKUP(D354,'Sheriffdom Look up'!$A$1:$E$102,5,FALSE)","v":"Tayside, Central & Fife"},"2020/21","Q1",9752,"FORFAR","S",3,0,0,0,0,0,0,0,0,0,170,73,33,116,18,0,0,301,2]
[{"$f":"VLOOKUP(D355,'Sheriffdom Look up'!$A$1:$E$102,5,FALSE)","v":"Grampian, Highland & Islands"},"2020/21","Q1",9753,"FORT WILLIAM","S",1,0,0,0,0,0,0,0,0,0,22,13,14,4,2,0,0,66,0]
[{"$f":"VLOOKUP(D356,'Sheriffdom Look up'!$A$1:$E$102,5,FALSE)","v":"Glasgow & Strathkelvin"},"2020/21","Q1",9761,"GLASGOW","S",510,261,251,115,36,60,0,0,116,117,2157,964,32,142,82,14,0,2818,420]
[{"$f":"VLOOKUP(D357,'Sheriffdom Look up'!$A$1:$E$102,5,FALSE)","v":"North Strathclyde"},"2020/21","Q1",9762,"GREENOCK","S",32,24,16,10,2,6,0,0,6,4,183,129,163,112,30,1,0,332,41]
[{"$f":"VLOOKUP(D358,'Sheriffdom Look up'!$A$1:$E$102,5,FALSE)","v":"South Strathclyde, Dumfries & Galloway"},"2020/21","Q1",9772,"HAMILTON","S",316,89,85,35,25,13,0,0,24,56,802,678,225,166,25,1,0,986,327]
[{"$f":"VLOOKUP(D359,'Sheriffdom Look up'!$A$1:$E$102,5,FALSE)","v":"Grampian, Highland & Islands"},"2020/21","Q1",9781,"INVERNESS","S",100,44,25,25,9,1,0,0,11,22,406,212,100,148,17,0,0,633,119]
[{"$f":"VLOOKUP(D360,'Sheriffdom Look up'!$A$1:$E$102,5,FALSE)","v":"Lothian & Borders"},"2020/21","Q1",9791,"JEDBURGH","S",2,0,0,5,0,2,0,0,2,0,49,21,0,60,7,0,0,123,0]
[{"$f":"VLOOKUP(D361,'Sheriffdom Look up'!$A$1:$E$102,5,FALSE)","v":"North Strathclyde"},"2020/21","Q1",9801,"KILMARNOCK","S",123,25,29,15,7,2,0,0,11,26,510,459,491,439,114,4,0,805,196]
[{"$f":"VLOOKUP(D362,'Sheriffdom Look up'!$A$1:$E$102,5,FALSE)","v":"Tayside, Central & Fife"},"2020/21","Q1",9803,"KIRKCALDY","S",39,7,0,1,0,0,0,0,14,4,333,227,121,353,30,1,0,639,51]
[{"$f":"VLOOKUP(D363,'Sheriffdom Look up'!$A$1:$E$102,5,FALSE)","v":"Grampian, Highland & Islands"},"2020/21","Q1",9805,"KIRKWALL","S",3,0,0,1,0,0,0,0,0,0,18,2,27,7,3,0,0,16,0]
[{"$f":"VLOOKUP(D364,'Sheriffdom Look up'!$A$1:$E$102,5,FALSE)","v":"South Strathclyde, Dumfries & Galloway"},"2020/21","Q1",9811,"LANARK","S",2,3,2,0,0,1,0,0,2,0,17,9,19,12,1,0,0,90,0]
[{"$f":"VLOOKUP(D365,'Sheriffdom Look up'!$A$1:$E$102,5,FALSE)","v":"Grampian, Highland & Islands"},"2020/21","Q1",9812,"LERWICK","S",2,0,0,0,0,1,0,0,1,0,13,13,4,11,5,0,0,28,3]
[{"$f":"VLOOKUP(D366,'Sheriffdom Look up'!$A$1:$E$102,5,FALSE)","v":"Grampian, Highland & Islands"},"2020/21","Q1",9814,"LOCHMADDY","S",0,0,0,0,0,0,0,0,0,0,4,4,3,2,0,0,0,9,0]
[{"$f":"VLOOKUP(D367,'Sheriffdom Look up'!$A$1:$E$102,5,FALSE)","v":"Lothian & Borders"},"2020/21","Q1",9815,"LIVINGSTON","S",27,0,0,0,0,0,0,0,9,0,233,221,52,7,29,0,0,538,30]
[{"$f":"VLOOKUP(D368,'Sheriffdom Look up'!$A$1:$E$102,5,FALSE)","v":"North Strathclyde"},"2020/21","Q1",9841,"OBAN","S",2,0,0,0,0,0,0,0,0,0,40,25,21,3,0,0,0,59,4]
[{"$f":"VLOOKUP(D369,'Sheriffdom Look up'!$A$1:$E$102,5,FALSE)","v":"North Strathclyde"},"2020/21","Q1",9851,"PAISLEY","S",161,41,49,14,7,12,0,0,19,21,430,337,449,193,56,0,0,786,105]
[{"$f":"VLOOKUP(D370,'Sheriffdom Look up'!$A$1:$E$102,5,FALSE)","v":"Tayside, Central & Fife"},"2020/21","Q1",9853,"PERTH","S",4,0,9,11,0,4,0,0,13,1,147,101,2,107,7,0,0,457,15]
[{"$f":"VLOOKUP(D371,'Sheriffdom Look up'!$A$1:$E$102,5,FALSE)","v":"Grampian, Highland & Islands"},"2020/21","Q1",9854,"PETERHEAD","S",2,0,0,0,0,0,0,0,0,0,125,106,95,73,35,0,0,193,5]
[{"$f":"VLOOKUP(D372,'Sheriffdom Look up'!$A$1:$E$102,5,FALSE)","v":"Grampian, Highland & Islands"},"2020/21","Q1",9855,"PORTREE","S",0,0,0,0,0,0,0,0,0,0,21,26,28,18,4,0,0,28,0]
[{"$f":"VLOOKUP(D373,'Sheriffdom Look up'!$A$1:$E$102,5,FALSE)","v":"Lothian & Borders"},"2020/21","Q1",9871,"SELKIRK","S",2,0,6,0,0,0,0,0,7,0,47,27,0,46,0,0,0,105,0]
[{"$f":"VLOOKUP(D374,'Sheriffdom Look up'!$A$1:$E$102,5,FALSE)","v":"Tayside, Central & Fife"},"2020/21","Q1",9872,"STIRLING","S",0,0,0,1,0,0,0,0,17,2,56,58,169,117,24,0,0,279,1]
[{"$f":"VLOOKUP(D375,'Sheriffdom Look up'!$A$1:$E$102,5,FALSE)","v":"Grampian, Highland & Islands"},"2020/21","Q1",9874,"STORNOWAY","S",1,0,0,0,0,0,0,0,0,0,44,15,34,1,3,0,0,40,0]
[{"$f":"VLOOKUP(D376,'Sheriffdom Look up'!$A$1:$E$102,5,FALSE)","v":"South Strathclyde, Dumfries & Galloway"},"2020/21","Q1",9875,"STRANRAER","S",3,2,1,1,0,2,0,0,3,0,29,3,8,16,4,0,0,106,0]
[{"$f":"VLOOKUP(D377,'Sheriffdom Look up'!$A$1:$E$102,5,FALSE)","v":"Grampian, Highland & Islands"},"2020/21","Q1",9881,"TAIN","S",0,0,0,0,0,0,0,0,0,0,31,11,9,13,3,0,0,82,0]
[{"$f":"VLOOKUP(D378,'Sheriffdom Look up'!$A$1:$E$102,5,FALSE)","v":"Grampian, Highland & Islands"},"2020/21","Q1",9891,"WICK","S",0,0,0,0,0,0,0,0,0,0,57,33,0,0,0,0,0,53,3]

{"sheet":"FY lookup","index":8,"n_rows":12,"n_cols":9,"rows_kept":12,"cut":false,"hidden":true,"merged":[[0,8,7,12]]}
["2013-04-01","2014-03-01","2013/14",null,null,4,"Q1",null,"This data is only for The Scottish Courts and Tribunals Service Internal use. Please go to the index tab and navigate as required."]
["2014-04-01","2015-03-01","2014/15",null,null,5,"Q1"]
["2015-04-01","2016-03-01","2015/16",null,null,6,"Q1"]
["2016-04-01","2017-03-01","2016/17",null,null,7,"Q2"]
["2017-04-01","2018-03-01","2017/18",null,null,8,"Q2"]
[null,null,null,null,null,9,"Q2"]
[null,null,null,null,null,10,"Q3"]
[null,null,null,null,null,11,"Q3"]
[null,null,null,null,null,12,"Q3"]
[null,null,null,null,null,1,"Q4"]
[null,null,null,null,null,2,"Q4"]
[null,null,null,null,null,3,"Q4"]

{"sheet":"Sheriff Court lookup","index":9,"n_rows":58,"n_cols":8,"rows_kept":58,"cut":false,"hidden":true,"merged":[[0,10,3,13],[1,3,7,5]]}
[null,"Court Name","Court Code",null,null,null,"Court Name","Court Code"]
[null,"National",0,"This data is only for The Scottish Courts and Tribunals Service Internal use. Please go to the index tab and navigate as required.",null,null,"National",1]
[null,"Glasgow & Strathkelvin",null,null,null,null,"Glasgow & Strathkelvin"]
[null,"Grampian, Highland & Islands",null,null,null,null,"Grampian, Highland & Islands"]
[null,"Lothian & Borders",null,null,null,null,"Lothian & Borders"]
[null,"North Strathclyde",null,null,null,null,"North Strathclyde"]
[null,"South Strathclyde, Dumfries & Galloway",null,null,null,null,"South Strathclyde, Dumfries & Galloway"]
[null,"Tayside, Central & Fife",null,null,null,null,"Tayside, Central & Fife"]
[null,"Aberdeen",9701,null,null,null,"Aberdeen",9251]
[null,"Airdrie",9702,null,null,null,"Airdrie",9355]
[null,"Alloa",9703,null,null,null,"Alloa",9240]
[null,"Ayr",9704,null,null,null,"Annan",9245]
[null,"Arbroath",9705,null,null,null,"Arbroath",9263]
[null,"Banff",9711,null,null,null,"Ayr",9360]
[null,"Campbeltown",9716,null,null,null,"Banff",9252]
[null,"Cupar",9717,null,null,null,"Campbeltown",9289]
[null,"Dingwall",9721,null,null,null,"Cumbernauld",9356]
[null,"Dornoch",9722,null,null,null,"Cupar",9285]
[null,"Dumbarton",9723,null,null,null,"Dingwall",9343]
[null,"Dumfries",9724,null,null,null,"Dornoch",9344]
[null,"Dundee",9726,null,null,null,"Dumbarton",9376]
[null,"Dunfermline",9727,null,null,null,"Dumfries",9246]
[null,"Dunoon",9728,null,null,null,"Dundee",9256]
[null,"Duns",9729,null,null,null,"Dunfermline",9286]
[null,"Edinburgh",9741,null,null,null,"Dunoon",9290]
[null,"Elgin",9742,null,null,null,"Duns",9350]
[null,"Falkirk",9751,null,null,null,"Edinburgh",9278]
[null,"Forfar",9752,null,null,null,"Elgin",9341]
[null,"Fort William",9753,null,null,null,"Falkirk",9282]
[null,"Glasgow",9761,null,null,null,"Forfar",9264]
[null,"Greenock",9762,null,null,null,"Fort William",9345]
[null,"Haddington",9771,null,null,null,"Glasgow",9295]
[null,"Hamilton",9772,null,null,null,"Greenock",9340]
[null,"Inverness",9781,null,null,null,"Haddington",9270]
[null,"Jedburgh",9791,null,null,null,"Hamilton",9366]
[null,"Kilmarnock",9801,null,null,null,"Inverness",9346]
[null,"Kirkcaldy",9803,null,null,null,"Irvine",9354]
[null,"Kirkcudbright",9804,null,null,null,"Jedburgh",9351]
[null,"Kirkwall",9805,null,null,null,"Kilmarnock",9261]
[null,"Lanark",9811,null,null,null,"Kirkcaldy",9287]
[null,"Lerwick",9812,null,null,null,"Kirkcudbright",9247]
[null,"Linlithgow",9813,null,null,null,"Lanark",9367]
[null,"Lochmaddy",9814,null,null,null,"Livingston",9380]
[null,"Livingston",9815,null,null,null,"Lochgilphead",9292]
[null,"Oban",9841,null,null,null,"Motherwell",9357]
[null,"Paisley",9851,null,null,null,"Oban",9293]
[null,"Peebles",9852,null,null,null,"Paisley",9342]
[null,"Perth",9853,null,null,null,"Peebles",9352]
[null,"Peterhead",9854,null,null,null,"Perth",9358]
[null,"Portree",9855,null,null,null,"Peterhead",9253]
[null,"Rothesay",9861,null,null,null,"Portree",9347]
[null,"Selkirk",9871,null,null,null,"Selkirk",9353]
[null,"Stirling",9872,null,null,null,"Stirling",9372]
[null,"Stonehaven",9873,null,null,null,"Stonehaven",9254]
[null,"Stornoway",9874,null,null,null,"Stornoway",9384]
[null,"Stranraer",9875,null,null,null,"Stranraer",9250]
[null,"Tain",9881,null,null,null,"Tain",9348]
[null,"Wick",9891,null,null,null,"Wick",9349]

{"sheet":"Internal analytics","index":10,"n_rows":49,"n_cols":36,"rows_kept":49,"cut":false,"hidden":true,"merged":[[48,1,56,2],[0,7,0,8],[2,1,2,2],[47,1,47,11],[3,1,11,1],[13,1,21,1],[23,1,33,1],[35,1,45,1]]}
[null,null,null,null,null,null,null,"Back to Index"]
[null,null,null,null,null,null,null,null,null,null,null,null,null,null,null,null,null,null,null,null,null,null,null,null,null,null,null,null,null,null,null,null,null,"Pandemic",null,"Pre-Pandemic"]
[null,"Monitoring criminal business trends during the Coronavirus pandemic",null,null,null,"2020-04-01","2020-05-01","2020-06-01","2020-07-01","2020-08-01","2020-09-01","2020-10-01","2020-11-01","2020-12-01","2021-01-01","2021-02-01","2021-03-01","2021-04-01","2021-05-01","2021-06-01","2021-07-01","2021-08-01","2021-09-01","2021-10-01","2021-11-01","2021-12-01","2022-01-01","2022-02-01","2022-03-01","2022-04-01","2022/23","2022/23 monthly average",null,"2020/22 monthly average ",null,"2019/20  monthly average"]
[null,"High Court ","Indictments Registered",{"$f":"SUMIFS(#REF!,#REF!,#REF!,#REF!,\"NATIONAL\")","v":{"$error":"#REF!"}},null,{"$f":"IF('1a'!D17=0,\"\",'1a'!D17)","v":77},{"$f":"IF('1a'!E17=0,\"\",'1a'!E17)","v":85},{"$f":"IF('1a'!F17=0,\"\",'1a'!F17)","v":69},{"$f":"IF('1a'!G17=0,\"\",'1a'!G17)","v":63},{"$f":"IF('1a'!H17=0,\"\",'1a'!H17)","v":46},{"$f":"IF('1a'!I17=0,\"\",'1a'!I17)","v":68},{"$f":"IF('1a'!J17=0,\"\",'1a'!J17)","v":60},{"$f":"IF('1a'!K17=0,\"\",'1a'!K17)","v":32},{"$f":"IF('1a'!L17=0,\"\",'1a'!L17)","v":48},{"$f":"IF('1a'!M17=0,\"\",'1a'!M17)","v":65},{"$f":"IF('1a'!N17=0,\"\",'1a'!N17)","v":64},{"$f":"IF('1a'!O17=0,\"\",'1a'!O17)","v":90},{"$f":"IF('1a'!P17=0,\"\",'1a'!P17)","v":55},{"$f":"IF('1a'!Q17=0,\"\",'1a'!Q17)","v":43},{"$f":"IF('1a'!R17=0,\"\",'1a'!R17)","v":57},{"$f":"IF('1a'!S17=0,\"\",'1a'!S17)","v":66},{"$f":"IF('1a'!T17=0,\"\",'1a'!T17)","v":37},{"$f":"IF('1a'!U17=0,\"\",'1a'!U17)","v":57},{"$f":"IF('1a'!V17=0,\"\",'1a'!V17)","v":69},{"$f":"IF('1a'!W17=0,\"\",'1a'!W17)","v":54},{"$f":"IF('1a'!X17=0,\"\",'1a'!X17)","v":69},{"$f":"IF('1a'!Y17=0,\"\",'1a'!Y17)","v":68},{"$f":"IF('1a'!Z17=0,\"\",'1a'!Z17)","v":90},{"$f":"IF('1a'!AA17=0,\"\",'1a'!AA17)","v":80},{"$f":"IF('1a'!AB17=0,\"\",'1a'!AB17)","v":77},{"$f":"IF('1a'!AC17=0,\"\",'1a'!AC17)","v":77},{"$f":"AE4/CONTROL!I5","v":77},null,{"$f":"SUM(F4:AD4)/CONTROL!I3","v":63.56},null,{"$f":"'1a'!AF17","v":85.333333333333329}]
[null,null,"Trials Called (TC)",{"$f":"SUMIFS(#REF!,#REF!,#REF!,#REF!,\"NATIONAL\")","v":{"$error":"#REF!"}},null,{"$f":"'1a'!D21","v":0},{"$f":"'1a'!E21","v":0},{"$f":"'1a'!F21","v":0},{"$f":"'1a'!G21","v":4},{"$f":"'1a'!H21","v":14},{"$f":"'1a'!I21","v":26},{"$f":"'1a'!J21","v":42},{"$f":"IF('1a'!K21=0,\"\",'1a'!K21)","v":58},{"$f":"IF('1a'!L21=0,\"\",'1a'!L21)","v":47},{"$f":"IF('1a'!M21=0,\"\",'1a'!M21)","v":56},{"$f":"IF('1a'!N21=0,\"\",'1a'!N21)","v":67},{"$f":"IF('1a'!O21=0,\"\",'1a'!O21)","v":66},{"$f":"IF('1a'!P21=0,\"\",'1a'!P21)","v":46},{"$f":"IF('1a'!Q21=0,\"\",'1a'!Q21)","v":60},{"$f":"IF('1a'!R21=0,\"\",'1a'!R21)","v":67},{"$f":"IF('1a'!S21=0,\"\",'1a'!S21)","v":58},{"$f":"IF('1a'!T21=0,\"\",'1a'!T21)","v":74},{"$f":"IF('1a'!U21=0,\"\",'1a'!U21)","v":64},{"$f":"IF('1a'!V21=0,\"\",'1a'!V21)","v":65},{"$f":"IF('1a'!W21=0,\"\",'1a'!W21)","v":81},{"$f":"IF('1a'!X21=0,\"\",'1a'!X21)","v":38},{"$f":"IF('1a'!Y21=0,\"\",'1a'!Y21)","v":62},{"$f":"IF('1a'!Z21=0,\"\",'1a'!Z21)","v":64},{"$f":"IF('1a'!AA21=0,\"\",'1a'!AA21)","v":73},{"$f":"IF('1a'!AB21=0,\"\",'1a'!AB21)","v":73},{"$f":"IF('1a'!AC21=0,\"\",'1a'!AC21)","v":73},{"$f":"AE5/CONTROL!I5","v":73},null,{"$f":"SUM(F5:AD5)/CONTROL!I3","v":48.2},null,{"$f":"'1a'!AF21","v":67.666666666666671}]
[null,null,"Evidence Led Trials (ELT)",{"$f":"SUMIFS(#REF!,#REF!,#REF!,#REF!,\"NATIONAL\")","v":{"$error":"#REF!"}},null,{"$f":"'1a'!D22","v":0},{"$f":"'1a'!E22","v":0},{"$f":"'1a'!F22","v":0},{"$f":"'1a'!G22","v":4},{"$f":"'1a'!H22","v":14},{"$f":"'1a'!I22","v":18},{"$f":"'1a'!J22","v":28},{"$f":"IF('1a'!K22=0,\"\",'1a'!K22)","v":49},{"$f":"IF('1a'!L22=0,\"\",'1a'!L22)","v":29},{"$f":"IF('1a'!M22=0,\"\",'1a'!M22)","v":43},{"$f":"IF('1a'!N22=0,\"\",'1a'!N22)","v":42},{"$f":"IF('1a'!O22=0,\"\",'1a'!O22)","v":51},{"$f":"IF('1a'!P22=0,\"\",'1a'!P22)","v":34},{"$f":"IF('1a'!Q22=0,\"\",'1a'!Q22)","v":43},{"$f":"IF('1a'!R22=0,\"\",'1a'!R22)","v":47},{"$f":"IF('1a'!S22=0,\"\",'1a'!S22)","v":48},{"$f":"IF('1a'!T22=0,\"\",'1a'!T22)","v":55},{"$f":"IF('1a'!U22=0,\"\",'1a'!U22)","v":47},{"$f":"IF('1a'!V22=0,\"\",'1a'!V22)","v":54},{"$f":"IF('1a'!W22=0,\"\",'1a'!W22)","v":63},{"$f":"IF('1a'!X22=0,\"\",'1a'!X22)","v":30},{"$f":"IF('1a'!Y22=0,\"\",'1a'!Y22)","v":47},{"$f":"IF('1a'!Z22=0,\"\",'1a'!Z22)","v":54},{"$f":"IF('1a'!AA22=0,\"\",'1a'!AA22)","v":55},{"$f":"IF('1a'!AB22=0,\"\",'1a'!AB22)","v":50},{"$f":"IF('1a'!AC22=0,\"\",'1a'!AC22)","v":50},{"$f":"AE6/CONTROL!I5","v":50},null,{"$f":"SUM(F6:AD6)/CONTROL!I3","v":36.200000000000003},null,{"$f":"'1a'!AF22","v":41.5}]
[null,null,"Conversion rate TC to ELT",null,null,{"$f":"IFERROR(F6/F5,\"n/a\")","v":"n/a"},{"$f":"IFERROR(G6/G5,\"n/a\")","v":"n/a"},{"$f":"IFERROR(H6/H5,\"n/a\")","v":"n/a"},{"$f":"IFERROR(I6/I5,\"\")","v":1},1,0.69230769230769229,0.66666666666666663,0.84482758620689657,0.61702127659574468,{"$f":"IFERROR(O6/O5,\"\")","v":0.7678571428571429},0.62686567164179108,0.77272727272727271,0.73913043478260865,{"$f":"IFERROR(S6/S5,\"\")","v":0.71666666666666667},{"$f":"IFERROR(T6/T5,\"\")","v":0.70149253731343286},{"$f":"IFERROR(U6/U5,\"\")","v":0.82758620689655171},0.7432432432432432,{"$f":"IFERROR(W6/W5,\"\")","v":0.734375},0.83076923076923082,{"$f":"IFERROR(Y6/Y5,\"\")","v":0.77777777777777779},0.78947368421052633,{"$f":"IFERROR(AA6/AA5,\"\")","v":0.75806451612903225},0.84375,{"$f":"IFERROR(AC6/AC5,\"\")","v":0.75342465753424659},0.68493150684931503,{"$f":"IFERROR(AE6/AE5,\"\")","v":0.68493150684931503},{"$f":"IFERROR(AF6/AF5,\"\")","v":0.68493150684931503},null,{"$f":"IFERROR(AH6/AH5,\"\")","v":0.75103734439834025},null,{"$f":"AJ6/AJ5","v":0.61330049261083741}]
[null,null,"All cases concluded",{"$f":"SUMIFS(#REF!,#REF!,\"NATIONAL\",#REF!,#REF!)","v":{"$error":"#REF!"}},null,{"$f":"'1a'!D25","v":7},{"$f":"'1a'!E25","v":9},{"$f":"'1a'!F25","v":14},{"$f":"'1a'!G25","v":32},{"$f":"'1a'!H25","v":35},20,{"$f":"IF('1a'!J25=0,\"\",'1a'!J25)","v":39},{"$f":"IF('1a'!K25=0,\"\",'1a'!K25)","v":54},{"$f":"IF('1a'!L25=0,\"\",'1a'!L25)","v":54},{"$f":"IF('1a'!M25=0,\"\",'1a'!M25)","v":55},{"$f":"IF('1a'!N25=0,\"\",'1a'!N25)","v":72},{"$f":"IF('1a'!O25=0,\"\",'1a'!O25)","v":64},{"$f":"IF('1a'!P25=0,\"\",'1a'!P25)","v":53},{"$f":"IF('1a'!Q25=0,\"\",'1a'!Q25)","v":58},{"$f":"IF('1a'!R25=0,\"\",'1a'!R25)","v":62},{"$f":"IF('1a'!S25=0,\"\",'1a'!S25)","v":58},{"$f":"IF('1a'!T25=0,\"\",'1a'!T25)","v":76},{"$f":"IF('1a'!U25=0,\"\",'1a'!U25)","v":62},{"$f":"IF('1a'!V25=0,\"\",'1a'!V25)","v":70},{"$f":"IF('1a'!W25=0,\"\",'1a'!W25)","v":82},{"$f":"IF('1a'!X25=0,\"\",'1a'!X25)","v":56},{"$f":"IF('1a'!Y25=0,\"\",'1a'!Y25)","v":45},{"$f":"IF('1a'!Z25=0,\"\",'1a'!Z25)","v":57},{"$f":"IF('1a'!AA25=0,\"\",'1a'!AA25)","v":77},{"$f":"IF('1a'!AB25=0,\"\",'1a'!AB25)","v":66},{"$f":"IF('1a'!AC25=0,\"\",'1a'!AC25)","v":66},{"$f":"AE8/CONTROL!I5","v":66},null,{"$f":"SUM(F8:AD8)/CONTROL!I3","v":51.08},null,{"$f":"'1a'!AF25","v":67.166666666666671}]
[null,null,"Trial Indictments concluded",null,null,0,0,0,4,11,15,25,44,41,35,47,44,36,30,47,50,53,47,57,53,46,34,50,64,48,{"$f":"AD9","v":48},{"$f":"AE9/CONTROL!I5","v":48},null,{"$f":"SUM(F9:AD9)/CONTROL!I3","v":35.24},null,{"$f":"505/12","v":42.083333333333336}]
[null,null,"Ratio of Registered to Concluded",{"$f":"SUMIFS(#REF!,#REF!,#REF!,#REF!,\"NATIONAL\",#REF!,\"3\")","v":{"$error":"#REF!"}},null,{"$f":"IFERROR(F8/F4,\"\")","v":9.0909090909090912E-2},0.10588235294117647,0.20289855072463769,0.50793650793650791,0.76086956521739135,0.29411764705882354,0.65,1.6875,1.125,{"$f":"IFERROR(O8/O4,\"\")","v":0.84615384615384615},1.125,0.71111111111111114,0.96363636363636362,1.3488372093023255,{"$f":"IFERROR(T8/T4,\"\")","v":1.0877192982456141},0.87878787878787878,2.0540540540540539,1.0877192982456141,1.0144927536231885,{"$f":"IFERROR(Y8/Y4,\"\")","v":1.5185185185185186},0.81159420289855078,{"$f":"IFERROR(AA8/AA4,\"\")","v":0.66176470588235292},0.6333333333333333,{"$f":"IFERROR(AC8/AC4,\"\")","v":0.96250000000000002},0.8571428571428571,{"$f":"IFERROR(AE8/AE4,\"\")","v":0.8571428571428571},{"$f":"AE10","v":0.8571428571428571},null,{"$f":"SUM(F10:AD10)/CONTROL!$I$3","v":0.8794991658289294},null,{"$f":"IFERROR(AJ8/AJ4,\"\")","v":0.78710937500000011}]
[null,null,"Ratio of Trials concluded to All concluded",null,null,{"$f":"IFERROR(F9/F8,\"\")","v":0},{"$f":"IFERROR(G9/G8,\"\")","v":0},{"$f":"IFERROR(H9/H8,\"\")","v":0},0.125,0.31428571428571428,0.75,{"$f":"IFERROR(L9/L8,\"\")","v":0.64102564102564108},{"$f":"IFERROR(M9/M8,\"\")","v":0.81481481481481477},0.7592592592592593,{"$f":"IFERROR(O9/O8,\"\")","v":0.63636363636363635},0.65277777777777779,0.6875,0.67924528301886788,0.51724137931034486,{"$f":"IFERROR(T9/T8,\"\")","v":0.75806451612903225},0.86206896551724133,0.69736842105263153,0.75806451612903225,0.81428571428571428,{"$f":"IFERROR(Y9/Y8,\"\")","v":0.64634146341463417},0.8214285714285714,{"$f":"IFERROR(AA9/AA8,\"\")","v":0.75555555555555554},0.8771929824561403,{"$f":"IFERROR(AC9/AC8,\"\")","v":0.83116883116883122},0.72727272727272729,{"$f":"IFERROR(AE9/AE8,\"\")","v":0.72727272727272729},{"$f":"AE11","v":0.72727272727272729},null,{"$f":"SUM(F11:AD11)/CONTROL!$I$3","v":0.60505303081064676},null,{"$f":"IFERROR(AJ9/AJ8,\"\")","v":0.62655086848635233}]
[null,null,"Scheduled Trials as at the end of the period",null,null,390,390,390,390,390,375,318,{"$f":"'1a'!K27","v":291},{"$f":"'1a'!L27","v":250},{"$f":"'1a'!M27","v":215},{"$f":"'1a'!N27","v":247},{"$f":"'1a'!O27","v":267},{"$f":"'1a'!P27","v":292},{"$f":"'1a'!Q27","v":304},{"$f":"'1a'!R27","v":313},{"$f":"'1a'!S27","v":325},{"$f":"'1a'!T27","v":432},{"$f":"'1a'!U27","v":389},{"$f":"'1a'!V27","v":444},{"$f":"'1a'!W27","v":476},{"$f":"'1a'!X27","v":516},{"$f":"'1a'!Y27","v":534},{"$f":"'1a'!Z27","v":535},{"$f":"'1a'!AA27","v":560},{"$f":"'1a'!AB27","v":609},{"$f":"'1a'!AC27","v":609},{"$f":"AVERAGE(R12:AC12)","v":426.66666666666669},null,{"$f":"SUM(F12:AD12)/CONTROL!$I$3","v":385.68},null,390]
[]
[null,"Sheriff Court - Solemn business ","Indictments Registered",{"$f":"SUMIFS(#REF!,#REF!,#REF!,#REF!,\"NATIONAL\")","v":{"$error":"#REF!"}},null,{"$f":"IF('1a'!D31=0,\"\",'1a'!D31)","v":219},{"$f":"IF('1a'!E31=0,\"\",'1a'!E31)","v":319},{"$f":"IF('1a'!F31=0,\"\",'1a'!F31)","v":355},{"$f":"IF('1a'!G31=0,\"\",'1a'!G31)","v":467},{"$f":"IF('1a'!H31=0,\"\",'1a'!H31)","v":496},{"$f":"IF('1a'!I31=0,\"\",'1a'!I31)","v":494},{"$f":"IF('1a'!J31=0,\"\",'1a'!J31)","v":492},{"$f":"IF('1a'!K31=0,\"\",'1a'!K31)","v":414},{"$f":"IF('1a'!L31=0,\"\",'1a'!L31)","v":428},{"$f":"IF('1a'!M31=0,\"\",'1a'!M31)","v":379},{"$f":"IF('1a'!N31=0,\"\",'1a'!N31)","v":378},{"$f":"IF('1a'!O31=0,\"\",'1a'!O31)","v":410},{"$f":"IF('1a'!P31=0,\"\",'1a'!P31)","v":441},{"$f":"IF('1a'!Q31=0,\"\",'1a'!Q31)","v":532},{"$f":"IF('1a'!R31=0,\"\",'1a'!R31)","v":471},{"$f":"IF('1a'!S31=0,\"\",'1a'!S31)","v":520},{"$f":"IF('1a'!T31=0,\"\",'1a'!T31)","v":447},{"$f":"IF('1a'!U31=0,\"\",'1a'!U31)","v":481},{"$f":"IF('1a'!V31=0,\"\",'1a'!V31)","v":479},{"$f":"IF('1a'!W31=0,\"\",'1a'!W31)","v":541},{"$f":"IF('1a'!X31=0,\"\",'1a'!X31)","v":450},{"$f":"IF('1a'!Y31=0,\"\",'1a'!Y31)","v":425},{"$f":"IF('1a'!Z31=0,\"\",'1a'!Z31)","v":525},{"$f":"IF('1a'!AA31=0,\"\",'1a'!AA31)","v":447},{"$f":"IF('1a'!AB31=0,\"\",'1a'!AB31)","v":421},{"$f":"IF('1a'!AC31=0,\"\",'1a'!AC31)","v":421},{"$f":"AE14/CONTROL!I5","v":421},null,{"$f":"SUM(F14:AD14)/CONTROL!I3","v":441.24},null,{"$f":"'1a'!AF31","v":454.33333333333331}]
[null,null,"Trials Called",{"$f":"SUMIFS(#REF!,#REF!,#REF!,#REF!,\"NATIONAL\")","v":{"$error":"#REF!"}},null,{"$f":"IF('1a'!D35=0,\"\",'1a'!D35)","v":91},{"$f":"IF('1a'!E35=0,\"\",'1a'!E35)","v":33},{"$f":"IF('1a'!F35=0,\"\",'1a'!F35)","v":31},{"$f":"IF('1a'!G35=0,\"\",'1a'!G35)","v":37},{"$f":"IF('1a'!H35=0,\"\",'1a'!H35)","v":146},{"$f":"IF('1a'!I35=0,\"\",'1a'!I35)","v":119},{"$f":"IF('1a'!J35=0,\"\",'1a'!J35)","v":73},{"$f":"IF('1a'!K35=0,\"\",'1a'!K35)","v":147},{"$f":"IF('1a'!L35=0,\"\",'1a'!L35)","v":78},{"$f":"IF('1a'!M35=0,\"\",'1a'!M35)","v":161},{"$f":"IF('1a'!N35=0,\"\",'1a'!N35)","v":285},{"$f":"IF('1a'!O35=0,\"\",'1a'!O35)","v":388},{"$f":"IF('1a'!P35=0,\"\",'1a'!P35)","v":362},{"$f":"IF('1a'!Q35=0,\"\",'1a'!Q35)","v":368},{"$f":"IF('1a'!R35=0,\"\",'1a'!R35)","v":383},{"$f":"IF('1a'!S35=0,\"\",'1a'!S35)","v":340},{"$f":"IF('1a'!T35=0,\"\",'1a'!T35)","v":392},{"$f":"IF('1a'!U35=0,\"\",'1a'!U35)","v":396},{"$f":"IF('1a'!V35=0,\"\",'1a'!V35)","v":393},{"$f":"IF('1a'!W35=0,\"\",'1a'!W35)","v":273},{"$f":"IF('1a'!X35=0,\"\",'1a'!X35)","v":263},{"$f":"IF('1a'!Y35=0,\"\",'1a'!Y35)","v":368},{"$f":"IF('1a'!Z35=0,\"\",'1a'!Z35)","v":433},{"$f":"IF('1a'!AA35=0,\"\",'1a'!AA35)","v":488},{"$f":"IF('1a'!AB35=0,\"\",'1a'!AB35)","v":425},{"$f":"IF('1a'!AC35=0,\"\",'1a'!AC35)","v":425},{"$f":"AE15/CONTROL!I5","v":425},null,{"$f":"SUM(F15:AD15)/CONTROL!I3","v":258.92},null,{"$f":"'1a'!AF35","v":261.83333333333331}]
[null,null,"Evidence Led Trials",{"$f":"SUMIFS(#REF!,#REF!,#REF!,#REF!,\"NATIONAL\")","v":{"$error":"#REF!"}},null,{"$f":"('1a'!D36)","v":0},{"$f":"('1a'!E36)","v":0},{"$f":"('1a'!F36)","v":0},{"$f":"('1a'!G36)","v":0},{"$f":"('1a'!H36)","v":0},{"$f":"('1a'!I36)","v":0},{"$f":"('1a'!J36)","v":0},{"$f":"('1a'!K36)","v":0},{"$f":"IF('1a'!L36=0,\"\",'1a'!L36)","v":11},{"$f":"IF('1a'!M36=0,\"\",'1a'!M36)","v":30},{"$f":"IF('1a'!N36=0,\"\",'1a'!N36)","v":56},{"$f":"IF('1a'!O36=0,\"\",'1a'!O36)","v":100},{"$f":"IF('1a'!P36=0,\"\",'1a'!P36)","v":84},{"$f":"IF('1a'!Q36=0,\"\",'1a'!Q36)","v":82},{"$f":"IF('1a'!R36=0,\"\",'1a'!R36)","v":88},{"$f":"IF('1a'!S36=0,\"\",'1a'!S36)","v":76},{"$f":"IF('1a'!T36=0,\"\",'1a'!T36)","v":83},{"$f":"IF('1a'!U36=0,\"\",'1a'!U36)","v":95},{"$f":"IF('1a'!V36=0,\"\",'1a'!V36)","v":70},{"$f":"IF('1a'!W36=0,\"\",'1a'!W36)","v":48},{"$f":"IF('1a'!X36=0,\"\",'1a'!X36)","v":52},{"$f":"IF('1a'!Y36=0,\"\",'1a'!Y36)","v":56},{"$f":"IF('1a'!Z36=0,\"\",'1a'!Z36)","v":78},{"$f":"IF('1a'!AA36=0,\"\",'1a'!AA36)","v":95},{"$f":"IF('1a'!AB36=0,\"\",'1a'!AB36)","v":75},{"$f":"IF('1a'!AC36=0,\"\",'1a'!AC36)","v":75},{"$f":"AE16/CONTROL!I5","v":75},null,{"$f":"SUM(F16:AD16)/CONTROL!I3","v":47.16},null,{"$f":"'1a'!AF36","v":94.5}]
[null,null,"Conversion rate TC to ELT",null,null,{"$f":"IFERROR(F16/F15,\"\")","v":0},{"$f":"IFERROR(G16/G15,\"\")","v":0},{"$f":"IFERROR(H16/H15,\"\")","v":0},0,0,{"$f":"IFERROR(K16/K15,\"\")","v":0},0,0,0.14102564102564102,0.18633540372670807,{"$f":"IFERROR(P16/P15,\"\")","v":0.19649122807017544},0.25773195876288657,{"$f":"IFERROR(R16/R15,\"\")","v":0.23204419889502761},0.22282608695652173,{"$f":"IFERROR(T16/T15,\"\")","v":0.2297650130548303},{"$f":"IFERROR(U16/U15,\"\")","v":0.22352941176470589},0.21173469387755103,{"$f":"IFERROR(W16/W15,\"\")","v":0.23989898989898989},0.17811704834605599,{"$f":"IFERROR(Y16/Y15,\"\")","v":0.17582417582417584},{"$f":"IFERROR(Z16/Z15,\"\")","v":0.19771863117870722},0.15217391304347827,0.18013856812933027,0.19467213114754098,{"$f":"IFERROR(AD16/AD15,\"\")","v":0.17647058823529413},{"$f":"IFERROR(AE16/AE15,\"\")","v":0.17647058823529413},0.17647058823529413,null,{"$f":"IFERROR(AH16/AH15,\"\")","v":0.18214120191564959},null,{"$f":"IFERROR(AJ16/AJ15,\"\")","v":0.36091661362189692}]
[null,null,"All cases concluded",{"$f":"SUMIFS(#REF!,#REF!,\"NATIONAL\",#REF!,#REF!)","v":{"$error":"#REF!"}},null,{"$f":"'1a'!D39","v":140},{"$f":"'1a'!E39","v":127},{"$f":"'1a'!F39","v":166},{"$f":"'1a'!G39","v":174},{"$f":"'1a'!H39","v":284},{"$f":"'1a'!I39","v":358},{"$f":"'1a'!J39","v":322},{"$f":"'1a'!K39","v":276},{"$f":"'1a'!L39","v":300},{"$f":"'1a'!M39","v":317},{"$f":"'1a'!N39","v":354},{"$f":"'1a'!O39","v":468},{"$f":"'1a'!P39","v":463},{"$f":"'1a'!Q39","v":442},{"$f":"'1a'!R39","v":459},{"$f":"'1a'!S39","v":453},{"$f":"'1a'!T39","v":451},{"$f":"'1a'!U39","v":439},{"$f":"'1a'!V39","v":403},{"$f":"'1a'!W39","v":414},{"$f":"'1a'!X39","v":363},{"$f":"'1a'!Y39","v":357},{"$f":"'1a'!Z39","v":427},{"$f":"'1a'!AA39","v":461},{"$f":"'1a'!AB39","v":475},{"$f":"'1a'!AC39","v":475},{"$f":"AE18/CONTROL!I5","v":475},null,{"$f":"SUM(F18:AD18)/CONTROL!I3","v":355.72},null,{"$f":"'1a'!AF39","v":429.58333333333331}]
[null,null,"Trial Indictments concluded",null,null,29,12,8,7,16,13,20,24,24,72,164,212,203,194,217,197,214,231,202,179,113,206,254,271,238,{"$f":"AD19","v":238},{"$f":"AE19/CONTROL!I5","v":238},null,{"$f":"SUM(F19:AD19)/CONTROL!I3","v":132.80000000000001},null,{"$f":"2353/12","v":196.08333333333334}]
[null,null,"Ratio of Registered to Concluded",{"$f":"SUMIFS(#REF!,#REF!,#REF!,#REF!,\"NATIONAL\",#REF!,\"3\")","v":{"$error":"#REF!"}},null,{"$f":"IFERROR(F18/F14,\"\")","v":0.63926940639269403},0.39811912225705332,0.46760563380281689,0.37259100642398285,0.57258064516129037,0.7246963562753036,0.65447154471544711,0.66666666666666663,0.7009345794392523,{"$f":"IFERROR(O18/O14,\"\")","v":0.83641160949868076},{"$f":"IFERROR(P18/P14,\"\")","v":0.93650793650793651},1.1414634146341462,{"$f":"IFERROR(R18/R14,\"\")","v":1.0498866213151927},0.83082706766917291,0.97452229299363058,0.87115384615384617,1.0089485458612975,{"$f":"IFERROR(W18/W14,\"\")","v":0.91268191268191268},0.84133611691022969,{"$f":"IFERROR(Y18/Y14,\"\")","v":0.76524953789279115},0.80666666666666664,{"$f":"IFERROR(AA18/AA14,\"\")","v":0.84},0.81333333333333335,{"$f":"IFERROR(AC18/AC14,\"\")","v":1.0313199105145414},1.1282660332541568,{"$f":"IFERROR(AE18/AE14,\"\")","v":1.1282660332541568},{"$f":"AE20","v":1.1282660332541568},null,{"$f":"SUM(F20:AD20)/CONTROL!$I$3","v":0.79942039228088146},null,{"$f":"IFERROR(AJ18/AJ14,\"\")","v":0.94552457813646373}]
[null,null,"Ratio of Trials concluded to All concluded",null,null,{"$f":"IFERROR(F19/F18,\"\")","v":0.20714285714285716},9.4488188976377951E-2,4.8192771084337352E-2,4.0229885057471264E-2,5.6338028169014086E-2,3.6312849162011177E-2,6.2111801242236024E-2,8.6956521739130432E-2,0.08,{"$f":"IFERROR(O19/O18,\"\")","v":0.22712933753943218},{"$f":"IFERROR(P19/P18,\"\")","v":0.4632768361581921},0.45299145299145299,{"$f":"IFERROR(R19/R18,\"\")","v":0.43844492440604754},0.43891402714932126,0.47276688453159044,0.43487858719646799,0.4745011086474501,{"$f":"IFERROR(W19/W18,\"\")","v":0.5261958997722096},0.50124069478908184,{"$f":"IFERROR(Y19/Y18,\"\")","v":0.43236714975845408},0.31129476584022037,{"$f":"IFERROR(AA19/AA18,\"\")","v":0.57703081232492992},0.59484777517564402,{"$f":"IFERROR(AC19/AC18,\"\")","v":0.5878524945770065},0.50105263157894742,{"$f":"IFERROR(AE19/AE18,\"\")","v":0.50105263157894742},{"$f":"AE21","v":0.50105263157894742},null,{"$f":"SUM(F21:AD21)/CONTROL!$I$3","v":0.32586233140039533},null,{"$f":"IFERROR(AJ19/AJ18,\"\")","v":0.45645004849660525}]
[null,null,"Scheduled Trials as at the end of the period",null,null,497,497,497,497,553,613,648,{"$f":"'1a'!K41","v":738},{"$f":"'1a'!L41","v":939},{"$f":"'1a'!M41","v":1091},{"$f":"'1a'!N41","v":1211},{"$f":"'1a'!O41","v":1329},{"$f":"'1a'!P41","v":1398},{"$f":"'1a'!Q41","v":1479},{"$f":"'1a'!R41","v":1595},{"$f":"'1a'!S41","v":1684},{"$f":"'1a'!T41","v":1781},{"$f":"'1a'!U41","v":1842},{"$f":"'1a'!V41","v":1923},{"$f":"'1a'!W41","v":2053},{"$f":"'1a'!X41","v":2170},{"$f":"'1a'!Y41","v":2212},{"$f":"'1a'!Z41","v":2196},{"$f":"'1a'!AA41","v":2274},{"$f":"'1a'!AB41","v":2267},{"$f":"'1a'!AC41","v":2267},{"$f":"AVERAGE(R22:AC22)","v":1883.9166666666667},null,{"$f":"SUM(F22:AD22)/CONTROL!$I$3","v":1359.36},null,497]
[]
[null,"Sheriff Court - Summary business","Complaints Registered",{"$f":"SUMIFS(#REF!,#REF!,#REF!,#REF!,\"NATIONAL\")","v":{"$error":"#REF!"}},null,{"$f":"IF('1a'!D44=0,\"\",'1a'!D44)","v":3016},{"$f":"IF('1a'!E44=0,\"\",'1a'!E44)","v":3247},{"$f":"IF('1a'!F44=0,\"\",'1a'!F44)","v":4309},{"$f":"IF('1a'!G44=0,\"\",'1a'!G44)","v":6205},{"$f":"IF('1a'!H44=0,\"\",'1a'!H44)","v":6037},{"$f":"IF('1a'!I44=0,\"\",'1a'!I44)","v":5855},{"$f":"IF('1a'!J44=0,\"\",'1a'!J44)","v":4634},{"$f":"IF('1a'!K44=0,\"\",'1a'!K44)","v":4383},{"$f":"IF('1a'!L44=0,\"\",'1a'!L44)","v":3956},{"$f":"IF('1a'!M44=0,\"\",'1a'!M44)","v":3790},{"$f":"IF('1a'!N44=0,\"\",'1a'!N44)","v":3678},{"$f":"IF('1a'!O44=0,\"\",'1a'!O44)","v":5000},{"$f":"IF('1a'!P44=0,\"\",'1a'!P44)","v":5017},{"$f":"IF('1a'!Q44=0,\"\",'1a'!Q44)","v":4603},{"$f":"IF('1a'!R44=0,\"\",'1a'!R44)","v":4544},{"$f":"IF('1a'!S44=0,\"\",'1a'!S44)","v":4440},{"$f":"IF('1a'!T44=0,\"\",'1a'!T44)","v":4718},{"$f":"IF('1a'!U44=0,\"\",'1a'!U44)","v":4453},{"$f":"IF('1a'!V44=0,\"\",'1a'!V44)","v":4510},{"$f":"IF('1a'!W44=0,\"\",'1a'!W44)","v":4770},{"$f":"IF('1a'!X44=0,\"\",'1a'!X44)","v":4860},{"$f":"IF('1a'!Y44=0,\"\",'1a'!Y44)","v":4614},{"$f":"IF('1a'!Z44=0,\"\",'1a'!Z44)","v":4007},{"$f":"IF('1a'!AA44=0,\"\",'1a'!AA44)","v":4970},{"$f":"IF('1a'!AB44=0,\"\",'1a'!AB44)","v":4423},{"$f":"IF('1a'!AC44=0,\"\",'1a'!AC44)","v":4423},{"$f":"AE24/CONTROL!I5","v":4423},null,{"$f":"SUM(F24:AD24)/CONTROL!I3","v":4561.5600000000004},null,{"$f":"'1a'!AF44","v":5457.5}]
[null,null,"Trials Called",{"$f":"SUMIFS(#REF!,#REF!,#REF!,#REF!,\"NATIONAL\")","v":{"$error":"#REF!"}},null,{"$f":"IF('1a'!D48=0,\"\",'1a'!D48)","v":802},{"$f":"IF('1a'!E48=0,\"\",'1a'!E48)","v":372},{"$f":"IF('1a'!F48=0,\"\",'1a'!F48)","v":154},{"$f":"IF('1a'!G48=0,\"\",'1a'!G48)","v":291},{"$f":"IF('1a'!H48=0,\"\",'1a'!H48)","v":2343},{"$f":"IF('1a'!I48=0,\"\",'1a'!I48)","v":3107},{"$f":"IF('1a'!J48=0,\"\",'1a'!J48)","v":3207},{"$f":"IF('1a'!K48=0,\"\",'1a'!K48)","v":3443},{"$f":"IF('1a'!L48=0,\"\",'1a'!L48)","v":3090},{"$f":"IF('1a'!M48=0,\"\",'1a'!M48)","v":3805},{"$f":"IF('1a'!N48=0,\"\",'1a'!N48)","v":737},{"$f":"IF('1a'!O48=0,\"\",'1a'!O48)","v":2371},{"$f":"IF('1a'!P48=0,\"\",'1a'!P48)","v":2657},{"$f":"IF('1a'!Q48=0,\"\",'1a'!Q48)","v":3171},{"$f":"IF('1a'!R48=0,\"\",'1a'!R48)","v":3887},{"$f":"IF('1a'!S48=0,\"\",'1a'!S48)","v":4169},{"$f":"IF('1a'!T48=0,\"\",'1a'!T48)","v":4499},{"$f":"IF('1a'!U48=0,\"\",'1a'!U48)","v":5443},{"$f":"IF('1a'!V48=0,\"\",'1a'!V48)","v":4266},{"$f":"IF('1a'!W48=0,\"\",'1a'!W48)","v":3428},{"$f":"IF('1a'!X48=0,\"\",'1a'!X48)","v":4703},{"$f":"IF('1a'!Y48=0,\"\",'1a'!Y48)","v":4537},{"$f":"IF('1a'!Z48=0,\"\",'1a'!Z48)","v":5093},{"$f":"IF('1a'!AA48=0,\"\",'1a'!AA48)","v":6599},{"$f":"IF('1a'!AB48=0,\"\",'1a'!AB48)","v":5094},{"$f":"IF('1a'!AC48=0,\"\",'1a'!AC48)","v":5094},{"$f":"AE25/CONTROL!I5","v":5094},null,{"$f":"SUM(F25:AD25)/CONTROL!I3","v":3250.72},null,{"$f":"'1a'!AF48","v":3394.0833333333335}]
[null,null,"Evidence Led Trials",{"$f":"SUMIFS(#REF!,#REF!,#REF!,#REF!,\"NATIONAL\")","v":{"$error":"#REF!"}},null,{"$f":"IF('1a'!D49=0,\"\",'1a'!D49)","v":5},{"$f":"IF('1a'!E49=0,\"\",'1a'!E49)","v":9},{"$f":"IF('1a'!F49=0,\"\",'1a'!F49)","v":24},{"$f":"IF('1a'!G49=0,\"\",'1a'!G49)","v":79},{"$f":"IF('1a'!H49=0,\"\",'1a'!H49)","v":283},{"$f":"IF('1a'!I49=0,\"\",'1a'!I49)","v":440},{"$f":"IF('1a'!J49=0,\"\",'1a'!J49)","v":479},{"$f":"IF('1a'!K49=0,\"\",'1a'!K49)","v":491},{"$f":"IF('1a'!L49=0,\"\",'1a'!L49)","v":399},{"$f":"IF('1a'!M49=0,\"\",'1a'!M49)","v":176},{"$f":"IF('1a'!N49=0,\"\",'1a'!N49)","v":86},{"$f":"IF('1a'!O49=0,\"\",'1a'!O49)","v":250},{"$f":"IF('1a'!P49=0,\"\",'1a'!P49)","v":352},{"$f":"IF('1a'!Q49=0,\"\",'1a'!Q49)","v":433},{"$f":"IF('1a'!R49=0,\"\",'1a'!R49)","v":471},{"$f":"IF('1a'!S49=0,\"\",'1a'!S49)","v":408},{"$f":"IF('1a'!T49=0,\"\",'1a'!T49)","v":459},{"$f":"IF('1a'!U49=0,\"\",'1a'!U49)","v":551},{"$f":"IF('1a'!V49=0,\"\",'1a'!V49)","v":439},{"$f":"IF('1a'!W49=0,\"\",'1a'!W49)","v":385},{"$f":"IF('1a'!X49=0,\"\",'1a'!X49)","v":422},{"$f":"IF('1a'!Y49=0,\"\",'1a'!Y49)","v":427},{"$f":"IF('1a'!Z49=0,\"\",'1a'!Z49)","v":552},{"$f":"IF('1a'!AA49=0,\"\",'1a'!AA49)","v":604},{"$f":"IF('1a'!AB49=0,\"\",'1a'!AB49)","v":505},{"$f":"IF('1a'!AC49=0,\"\",'1a'!AC49)","v":505},{"$f":"AE26/CONTROL!I5","v":505},null,{"$f":"SUM(F26:AD26)/CONTROL!I3","v":349.16},null,{"$f":"'1a'!AF49","v":578.83333333333337}]
[null,null,"Conversion rate TC to ELT",null,null,{"$f":"IFERROR(F26/F25,\"\")","v":6.2344139650872821E-3},2.4193548387096774E-2,0.15584415584415584,0.27147766323024053,0.12078531796841656,0.14161570646926294,0.1493607733083879,0.14260819053151322,0.129126213592233,4.6254927726675429E-2,{"$f":"IFERROR(P26/P25,\"\")","v":0.11668928086838534},0.10544074230282581,{"$f":"IFERROR(R26/R25,\"\")","v":0.13248024087316523},{"$f":"IFERROR(S26/S25,\"\")","v":0.13654998423210343},0.12117314124003087,{"$f":"IFERROR(U26/U25,\"\")","v":9.7865195490525303E-2},{"$f":"IFERROR(V26/V25,\"\")","v":0.10202267170482329},{"$f":"IFERROR(W26/W25,\"\")","v":0.10123093882050339},0.10290670417252695,{"$f":"IFERROR(Y26/Y25,\"\")","v":0.11231038506417736},8.9729959600255163E-2,{"$f":"IFERROR(AA26/AA25,\"\")","v":9.4115054000440818E-2},0.10838405654820342,{"$f":"IFERROR(AC26/AC25,\"\")","v":9.1529019548416427E-2},9.9136238712210445E-2,{"$f":"IFERROR(AE26/AE25,\"\")","v":9.9136238712210445E-2},{"$f":"IFERROR(AF26/AF25,\"\")","v":9.9136238712210445E-2},null,{"$f":"IFERROR(AH26/AH25,\"\")","v":0.1074100506964611},null,{"$f":"IFERROR(AJ26/AJ25,\"\")","v":0.17054187434015075}]
[null,null,"All cases concluded",{"$f":"SUMIFS(#REF!,#REF!,\"NATIONAL\",#REF!,#REF!)","v":{"$error":"#REF!"}},null,{"$f":"IF('1a'!D52=0,\"\",'1a'!D52)","v":429},{"$f":"IF('1a'!E52=0,\"\",'1a'!E52)","v":744},{"$f":"IF('1a'!F52=0,\"\",'1a'!F52)","v":1146},{"$f":"IF('1a'!G52=0,\"\",'1a'!G52)","v":2227},{"$f":"IF('1a'!H52=0,\"\",'1a'!H52)","v":4084},{"$f":"IF('1a'!I52=0,\"\",'1a'!I52)","v":4759},{"$f":"IF('1a'!J52=0,\"\",'1a'!J52)","v":4395},{"$f":"IF('1a'!K52=0,\"\",'1a'!K52)","v":4244},{"$f":"IF('1a'!L52=0,\"\",'1a'!L52)","v":3944},{"$f":"IF('1a'!M52=0,\"\",'1a'!M52)","v":2071},{"$f":"IF('1a'!N52=0,\"\",'1a'!N52)","v":1665},{"$f":"IF('1a'!O52=0,\"\",'1a'!O52)","v":2735},{"$f":"IF('1a'!P52=0,\"\",'1a'!P52)","v":3466},{"$f":"IF('1a'!Q52=0,\"\",'1a'!Q52)","v":4181},{"$f":"IF('1a'!R52=0,\"\",'1a'!R52)","v":4547},{"$f":"IF('1a'!S52=0,\"\",'1a'!S52)","v":4446},{"$f":"IF('1a'!T52=0,\"\",'1a'!T52)","v":4654},{"$f":"IF('1a'!U52=0,\"\",'1a'!U52)","v":5186},{"$f":"IF('1a'!V52=0,\"\",'1a'!V52)","v":4099},{"$f":"IF('1a'!W52=0,\"\",'1a'!W52)","v":4162},{"$f":"IF('1a'!X52=0,\"\",'1a'!X52)","v":4410},{"$f":"IF('1a'!Y52=0,\"\",'1a'!Y52)","v":4126},{"$f":"IF('1a'!Z52=0,\"\",'1a'!Z52)","v":4995},{"$f":"IF('1a'!AA52=0,\"\",'1a'!AA52)","v":5929},{"$f":"IF('1a'!AB52=0,\"\",'1a'!AB52)","v":4987},{"$f":"IF('1a'!AC52=0,\"\",'1a'!AC52)","v":4987},{"$f":"AE28/CONTROL!I5","v":4987},null,{"$f":"SUM(F28:AD28)/CONTROL!I3","v":3665.24},null,{"$f":"'1a'!AF52","v":4771.333333333333}]
[null,null,"Trial Complaints concluded",null,null,33,34,62,204,1199,1657,1742,1934,1611,602,177,677,1212,1656,1863,1935,2154,2747,2170,1764,2316,1828,2741,3545,2828,{"$f":"AD29","v":2828},{"$f":"AE29/CONTROL!I5","v":2828},null,{"$f":"SUM(F29:AD29)/CONTROL!I3","v":1547.64},null,{"$f":"25101/12","v":2091.75}]
[null,null,"Ratio of Registered to Concluded",{"$f":"SUMIFS(#REF!,#REF!,#REF!,#REF!,\"NATIONAL\",#REF!,\"3\")","v":{"$error":"#REF!"}},null,{"$f":"IFERROR(F28/F24,\"\")","v":0.14224137931034483},0.22913458577148138,0.2659549779531214,0.35890410958904112,0.67649494782176578,0.8128095644748079,0.94842468709538197,0.96828656171571981,0.99696663296258847,0.54643799472295518,{"$f":"IFERROR(P28/P24,\"\")","v":0.45269168026101142},0.54700000000000004,{"$f":"IFERROR(R28/R24,\"\")","v":0.69085110623878809},{"$f":"IFERROR(S28/S24,\"\")","v":0.90832066043884419},1.0006602112676057,1.0013513513513514,0.98643493005510807,1.1646081293509993,{"$f":"IFERROR(X28/X24,\"\")","v":0.90886917960088687},{"$f":"IFERROR(Y28/Y24,\"\")","v":0.87253668763102721},0.90740740740740744,{"$f":"IFERROR(AA28/AA24,\"\")","v":0.89423493714781099},1.2465685051160469,{"$f":"IFERROR(AC28/AC24,\"\")","v":1.1929577464788732},1.1275152611349764,{"$f":"IFERROR(AE28/AE24,\"\")","v":1.1275152611349764},{"$f":"AE30","v":1.1275152611349764},null,{"$f":"SUM(F30:AD30)/CONTROL!$I$3","v":0.79390652939591788},null,{"$f":"IFERROR(AJ28/AJ24,\"\")","v":0.87427088105054196}]
[null,null,"Ratio of Trials concluded to All concluded",null,null,{"$f":"IFERROR(F29/F28,\"\")","v":7.6923076923076927E-2},4.5698924731182797E-2,5.4101221640488653E-2,9.1603053435114504E-2,0.29358472086190007,0.34818239125866779,0.39635949943117177,0.45570216776625827,0.40846855983772817,0.29068083051665861,{"$f":"IFERROR(P29/P28,\"\")","v":0.1063063063063063},0.24753199268738574,{"$f":"IFERROR(R29/R28,\"\")","v":0.34968263127524524},{"$f":"IFERROR(S29/S28,\"\")","v":0.39607749342262616},0.40972069496371233,0.43522267206477733,0.46282767511817791,0.52969533359043575,{"$f":"IFERROR(X29/X28,\"\")","v":0.52939741400341545},{"$f":"IFERROR(Y29/Y28,\"\")","v":0.42383469485824121},0.52517006802721089,{"$f":"IFERROR(AA29/AA28,\"\")","v":0.44304411051866216},0.54874874874874879,{"$f":"IFERROR(AC29/AC28,\"\")","v":0.59790858492157195},0.56707439342289956,{"$f":"IFERROR(AE29/AE28,\"\")","v":0.56707439342289956},{"$f":"AE31","v":0.56707439342289956},null,{"$f":"SUM(F31:AD31)/CONTROL!$I$3","v":0.36134189041326659},null,{"$f":"IFERROR(AJ29/AJ28,\"\")","v":0.43839946905127852}]
[null,null,"Intermediate diets concluded",null,null,71,62,138,368,1018,1055,948,739,854,442,603,791,835,884,1005,946,1050,1054,585,984,754,912,906,943,752,{"$f":"AD32","v":752},{"$f":"AE32/CONTROL!I5","v":752},null,{"$f":"SUM(F32:AD32)/CONTROL!I3","v":747.96},null,{"$f":"11135/12","v":927.91666666666663}]
[null,null,"After Warrant Guilty Pleas",null,null,130,103,197,245,343,466,572,721,500,458,400,459,408,411,468,518,503,502,603,507,526,535,501,558,619,{"$f":"AD33","v":619},{"$f":"AE33/CONTROL!I5","v":619},null,{"$f":"SUM(F33:AD33)/CONTROL!I3","v":450.12},null,{"$f":"10454/12","v":871.16666666666663}]
[null,null,"Scheduled Trials as at the end of the period",null,null,13967,15854,17818,20929,22932,25146,26370,{"$f":"'1a'!K54","v":27372},{"$f":"'1a'!L54","v":27723},{"$f":"'1a'!M54","v":28548},{"$f":"'1a'!N54","v":29324},{"$f":"'1a'!O54","v":30645},{"$f":"'1a'!P54","v":31799},{"$f":"'1a'!Q54","v":32778},{"$f":"'1a'!R54","v":33598},{"$f":"'1a'!S54","v":33602},{"$f":"'1a'!T54","v":33369},{"$f":"'1a'!U54","v":32433},{"$f":"'1a'!V54","v":32488},{"$f":"'1a'!W54","v":33015},{"$f":"'1a'!X54","v":32394},{"$f":"'1a'!Y54","v":32759},{"$f":"'1a'!Z54","v":31904},{"$f":"'1a'!AA54","v":30520},{"$f":"'1a'!AB54","v":29793},{"$f":"'1a'!AC54","v":29793},{"$f":"AVERAGE(R34:AC34)","v":32554.916666666668},null,{"$f":"SUM(F34:AD34)/CONTROL!$I$3","v":28283.200000000001},null,13971]
[]
[null,"Justice of the Peace Court ","Complaints Registered",{"$f":"SUMIFS(#REF!,#REF!,#REF!,#REF!,\"NATIONAL\")","v":{"$error":"#REF!"}},null,{"$f":"IF('1a'!D57=0,\"\",'1a'!D57)","v":1994},{"$f":"IF('1a'!E57=0,\"\",'1a'!E57)","v":910},{"$f":"IF('1a'!F57=0,\"\",'1a'!F57)","v":987},{"$f":"IF('1a'!G57=0,\"\",'1a'!G57)","v":1823},{"$f":"IF('1a'!H57=0,\"\",'1a'!H57)","v":1064},{"$f":"IF('1a'!I57=0,\"\",'1a'!I57)","v":916},{"$f":"IF('1a'!J57=0,\"\",'1a'!J57)","v":1717},{"$f":"IF('1a'!K57=0,\"\",'1a'!K57)","v":1221},{"$f":"IF('1a'!L57=0,\"\",'1a'!L57)","v":1426},{"$f":"IF('1a'!M57=0,\"\",'1a'!M57)","v":1469},{"$f":"IF('1a'!N57=0,\"\",'1a'!N57)","v":1345},{"$f":"IF('1a'!O57=0,\"\",'1a'!O57)","v":2060},{"$f":"IF('1a'!P57=0,\"\",'1a'!P57)","v":1992},{"$f":"IF('1a'!Q57=0,\"\",'1a'!Q57)","v":1731},{"$f":"IF('1a'!R57=0,\"\",'1a'!R57)","v":2064},{"$f":"IF('1a'!S57=0,\"\",'1a'!S57)","v":1717},{"$f":"IF('1a'!T57=0,\"\",'1a'!T57)","v":2012},{"$f":"IF('1a'!U57=0,\"\",'1a'!U57)","v":2133},{"$f":"IF('1a'!V57=0,\"\",'1a'!V57)","v":2108},{"$f":"IF('1a'!W57=0,\"\",'1a'!W57)","v":2034},{"$f":"IF('1a'!X57=0,\"\",'1a'!X57)","v":1856},{"$f":"IF('1a'!Y57=0,\"\",'1a'!Y57)","v":1787},{"$f":"IF('1a'!Z57=0,\"\",'1a'!Z57)","v":1611},{"$f":"IF('1a'!AA57=0,\"\",'1a'!AA57)","v":2512},{"$f":"IF('1a'!AB57=0,\"\",'1a'!AB57)","v":1893},{"$f":"IF('1a'!AC57=0,\"\",'1a'!AC57)","v":1893},{"$f":"AE36/CONTROL!I5","v":1893},null,{"$f":"SUM(F36:AD36)/CONTROL!I3","v":1695.28},null,{"$f":"'1a'!AF57","v":2798.5}]
[null,null,"Trials Called",{"$f":"SUMIFS(#REF!,#REF!,#REF!,#REF!,\"NATIONAL\")","v":{"$error":"#REF!"}},null,{"$f":"IF('1a'!D61=0,\"\",'1a'!D61)","v":126},{"$f":"IF('1a'!E61=0,\"\",'1a'!E61)","v":71},{"$f":"IF('1a'!F61=0,\"\",'1a'!F61)","v":7},{"$f":"IF('1a'!G61=0,\"\",'1a'!G61)","v":23},{"$f":"IF('1a'!H61=0,\"\",'1a'!H61)","v":308},{"$f":"IF('1a'!I61=0,\"\",'1a'!I61)","v":698},{"$f":"IF('1a'!J61=0,\"\",'1a'!J61)","v":658},{"$f":"IF('1a'!K61=0,\"\",'1a'!K61)","v":738},{"$f":"IF('1a'!L61=0,\"\",'1a'!L61)","v":653},{"$f":"IF('1a'!M61=0,\"\",'1a'!M61)","v":860},{"$f":"IF('1a'!N61=0,\"\",'1a'!N61)","v":111},{"$f":"IF('1a'!O61=0,\"\",'1a'!O61)","v":276},{"$f":"IF('1a'!P61=0,\"\",'1a'!P61)","v":102},{"$f":"IF('1a'!Q61=0,\"\",'1a'!Q61)","v":50},{"$f":"IF('1a'!R61=0,\"\",'1a'!R61)","v":240},{"$f":"IF('1a'!S61=0,\"\",'1a'!S61)","v":495},{"$f":"IF('1a'!T61=0,\"\",'1a'!T61)","v":952},{"$f":"IF('1a'!U61=0,\"\",'1a'!U61)","v":875},{"$f":"IF('1a'!V61=0,\"\",'1a'!V61)","v":725},{"$f":"IF('1a'!W61=0,\"\",'1a'!W61)","v":638},{"$f":"IF('1a'!X61=0,\"\",'1a'!X61)","v":878},{"$f":"IF('1a'!Y61=0,\"\",'1a'!Y61)","v":681},{"$f":"IF('1a'!Z61=0,\"\",'1a'!Z61)","v":882},{"$f":"IF('1a'!AA61=0,\"\",'1a'!AA61)","v":1116},{"$f":"IF('1a'!AB61=0,\"\",'1a'!AB61)","v":964},{"$f":"IF('1a'!AC61=0,\"\",'1a'!AC61)","v":964},{"$f":"AE37/CONTROL!I5","v":964},null,{"$f":"SUM(F37:AD37)/CONTROL!I3","v":525.08000000000004},null,{"$f":"'1a'!AF61","v":838.41666666666663}]
[null,null,"Evidence Led Trials",{"$f":"SUMIFS(#REF!,#REF!,#REF!,#REF!,\"NATIONAL\")","v":{"$error":"#REF!"}},null,{"$f":"'1a'!D62","v":0},{"$f":"'1a'!E62","v":0},{"$f":"'1a'!F62","v":0},{"$f":"IF('1a'!G62=0,\"\",'1a'!G62)","v":1},{"$f":"IF('1a'!H62=0,\"\",'1a'!H62)","v":23},{"$f":"IF('1a'!I62=0,\"\",'1a'!I62)","v":68},{"$f":"IF('1a'!J62=0,\"\",'1a'!J62)","v":68},{"$f":"IF('1a'!K62=0,\"\",'1a'!K62)","v":87},{"$f":"IF('1a'!L62=0,\"\",'1a'!L62)","v":73},{"$f":"IF('1a'!M62=0,\"\",'1a'!M62)","v":27},{"$f":"IF('1a'!N62=0,\"\",'1a'!N62)","v":2},{"$f":"'1a'!O62","v":0},{"$f":"'1a'!P62","v":0},{"$f":"'1a'!Q62","v":0},{"$f":"'1a'!R62","v":16},{"$f":"'1a'!S62","v":51},{"$f":"'1a'!T62","v":67},{"$f":"'1a'!U62","v":82},{"$f":"'1a'!V62","v":63},{"$f":"'1a'!W62","v":45},{"$f":"'1a'!X62","v":45},{"$f":"'1a'!Y62","v":6},{"$f":"'1a'!Z62","v":70},{"$f":"'1a'!AA62","v":73},{"$f":"'1a'!AB62","v":61},{"$f":"'1a'!AC62","v":61},{"$f":"AE38/CONTROL!I5","v":61},null,{"$f":"SUM(F38:AD38)/CONTROL!I3","v":37.119999999999997},null,{"$f":"'1a'!AF62","v":128.58333333333334}]
[null,null,"Conversion rate TC to ELT",null,null,{"$f":"IFERROR(F38/F37,\"\")","v":0},0,0,4.3478260869565216E-2,7.4675324675324672E-2,9.7421203438395415E-2,0.10334346504559271,{"$f":"IFERROR(M38/M37,\"\")","v":0.11788617886178862},0.11179173047473201,3.1395348837209305E-2,1.8018018018018018E-2,0,{"$f":"IFERROR(R38/R37,\"\")","v":0},{"$f":"IFERROR(S38/S37,\"\")","v":0},{"$f":"IFERROR(T38/T37,\"\")","v":6.6666666666666666E-2},{"$f":"IFERROR(U38/U37,\"\")","v":0.10303030303030303},7.0378151260504201E-2,{"$f":"IFERROR(W38/W37,\"\")","v":9.3714285714285708E-2},8.6896551724137933E-2,{"$f":"IFERROR(Y38/Y37,\"\")","v":7.0532915360501561E-2},5.125284738041002E-2,{"$f":"IFERROR(AA38/AA37,\"\")","v":8.8105726872246704E-3},7.9365079365079361E-2,{"$f":"IFERROR(AC38/AC37,\"\")","v":6.5412186379928322E-2},6.3278008298755184E-2,{"$f":"IFERROR(AE38/AE37,\"\")","v":6.3278008298755184E-2},{"$f":"IFERROR(AF38/AF37,\"\")","v":6.3278008298755184E-2},null,{"$f":"IFERROR(AH38/AH37,\"\")","v":7.0693989487316214E-2},null,{"$f":"IFERROR(AJ38/AJ37,\"\")","v":0.15336447669217773}]
[null,null,"All cases concluded",{"$f":"SUMIFS(#REF!,#REF!,\"NATIONAL\",#REF!,#REF!)","v":{"$error":"#REF!"}},null,{"$f":"IF('1a'!D65=0,\"\",'1a'!D65)","v":10},{"$f":"IF('1a'!E65=0,\"\",'1a'!E65)","v":50},{"$f":"IF('1a'!F65=0,\"\",'1a'!F65)","v":193},{"$f":"IF('1a'!G65=0,\"\",'1a'!G65)","v":459},{"$f":"IF('1a'!H65=0,\"\",'1a'!H65)","v":1389},{"$f":"IF('1a'!I65=0,\"\",'1a'!I65)","v":1822},{"$f":"IF('1a'!J65=0,\"\",'1a'!J65)","v":1651},{"$f":"IF('1a'!K65=0,\"\",'1a'!K65)","v":1683},{"$f":"IF('1a'!L65=0,\"\",'1a'!L65)","v":1624},{"$f":"IF('1a'!M65=0,\"\",'1a'!M65)","v":627},{"$f":"IF('1a'!N65=0,\"\",'1a'!N65)","v":135},{"$f":"IF('1a'!O65=0,\"\",'1a'!O65)","v":332},{"$f":"IF('1a'!P65=0,\"\",'1a'!P65)","v":206},{"$f":"IF('1a'!Q65=0,\"\",'1a'!Q65)","v":315},{"$f":"IF('1a'!R65=0,\"\",'1a'!R65)","v":2017},{"$f":"IF('1a'!S65=0,\"\",'1a'!S65)","v":3032},{"$f":"IF('1a'!T65=0,\"\",'1a'!T65)","v":2797},{"$f":"IF('1a'!U65=0,\"\",'1a'!U65)","v":2498},{"$f":"IF('1a'!V65=0,\"\",'1a'!V65)","v":2022},{"$f":"IF('1a'!W65=0,\"\",'1a'!W65)","v":1921},{"$f":"IF('1a'!X65=0,\"\",'1a'!X65)","v":1781},{"$f":"IF('1a'!Y65=0,\"\",'1a'!Y65)","v":1513},{"$f":"IF('1a'!Z65=0,\"\",'1a'!Z65)","v":1741},{"$f":"IF('1a'!AA65=0,\"\",'1a'!AA65)","v":2215},{"$f":"IF('1a'!AB65=0,\"\",'1a'!AB65)","v":2093},{"$f":"IF('1a'!AC65=0,\"\",'1a'!AC65)","v":2093},{"$f":"AE40/CONTROL!I5","v":2093},null,{"$f":"SUM(F40:AD40)/CONTROL!I3","v":1365.04},null,{"$f":"'1a'!AF65","v":2557.1666666666665}]
[null,null,"Trial complaints concluded",null,null,1,3,3,11,131,363,349,407,346,93,6,2,1,0,76,279,493,495,401,360,409,174,478,624,529,{"$f":"SUM(AD41)","v":529},{"$f":"AE41/CONTROL!I5","v":529},null,{"$f":"SUM(F41:AD41)/CONTROL!I3","v":241.36},null,{"$f":"6234/12","v":519.5}]
[null,null,"Ratio of Registered to Concluded",{"$f":"SUMIFS(#REF!,#REF!,#REF!,#REF!,\"NATIONAL\",#REF!,\"3\")","v":{"$error":"#REF!"}},null,{"$f":"IFERROR(F40/F36,\"\")","v":5.0150451354062184E-3},5.4945054945054944E-2,0.1955420466058764,0.25178277564454199,1.3054511278195489,1.9890829694323144,0.96156086196854984,{"$f":"IFERROR(M40/M36,\"\")","v":1.3783783783783783},1.1388499298737729,{"$f":"IFERROR(O40/O36,\"\")","v":0.42682096664397551},0.10037174721189591,0.16116504854368932,{"$f":"IFERROR(R40/R36,\"\")","v":0.10341365461847389},{"$f":"IFERROR(S40/S36,\"\")","v":0.18197573656845753},0.9772286821705426,1.7658707047175306,1.3901590457256461,1.1711204875761838,{"$f":"IFERROR(X40/X36,\"\")","v":0.95920303605313095},{"$f":"IFERROR(Y40/Y36,\"\")","v":0.94444444444444442},0.95959051724137934,{"$f":"IFERROR(AA40/AA36,\"\")","v":0.84667039731393401},1.0806952203600249,{"$f":"IFERROR(AC40/AC36,\"\")","v":0.88176751592356684},1.1056524035921818,{"$f":"IFERROR(AE40/AE36,\"\")","v":1.1056524035921818},{"$f":"AE42","v":1.1056524035921818},null,{"$f":"SUM(F42:AD42)/CONTROL!$I$3","v":0.81347031194034003},null,{"$f":"IFERROR(AJ40/AJ36,\"\")","v":0.91376332559109041}]
[null,null,"Ratio of Trials concluded to All concluded",null,null,{"$f":"IFERROR(F41/F40,\"\")","v":0.1},0.06,1.5544041450777202E-2,2.3965141612200435E-2,9.4312455003599707E-2,0.19923161361141603,0.2113870381586917,{"$f":"IFERROR(M41/M40,\"\")","v":0.24183006535947713},0.21305418719211822,{"$f":"IFERROR(O41/O40,\"\")","v":0.14832535885167464},4.4444444444444446E-2,6.024096385542169E-3,{"$f":"IFERROR(R41/R40,\"\")","v":4.8543689320388345E-3},{"$f":"IFERROR(S41/S40,\"\")","v":0},3.7679722359940507E-2,9.2018469656992091E-2,0.17626027887021808,0.19815852682145715,{"$f":"IFERROR(X41/X40,\"\")","v":0.19831849653808112},{"$f":"IFERROR(Y41/Y40,\"\")","v":0.18740239458615304},0.22964626614261652,{"$f":"IFERROR(AA41/AA40,\"\")","v":0.11500330469266358},0.27455485353245263,{"$f":"IFERROR(AC41/AC40,\"\")","v":0.28171557562076749},0.25274725274725274,{"$f":"IFERROR(AE41/AE40,\"\")","v":0.25274725274725274},{"$f":"AE43","v":0.25274725274725274},null,{"$f":"SUM(F43:AD43)/CONTROL!$I$3","v":0.13625911810282304},null,{"$f":"IFERROR(AJ41/AJ40,\"\")","v":0.20315453301179692}]
[null,null,"Intermediate diets concluded",null,null,6,3,15,47,220,281,226,165,180,79,33,8,6,25,172,211,232,272,170,208,176,257,227,243,225,{"$f":"SUM(AD44)","v":225},{"$f":"SUM(AE44)/CONTROL!I5","v":225},null,{"$f":"SUM(F44:AD44)/CONTROL!I3","v":147.47999999999999},null,{"$f":"3292/12","v":274.33333333333331}]
[null,null,"After Warrant Guilty Pleas",null,null,4,3,7,30,47,74,63,85,72,30,22,20,29,18,28,35,58,65,81,93,69,71,87,88,76,{"$f":"SUM(AD45)","v":76},{"$f":"SUM(AE45)/CONTROL!I5","v":76},null,{"$f":"SUM(F45:AD45)/CONTROL!I3","v":50.2},null,{"$f":"2619/12","v":218.25}]
[null,null,"Scheduled Trials as at the end of the period",null,null,3220,3495,3732,4088,4491,4837,5074,{"$f":"'1a'!K67","v":5189},{"$f":"'1a'!L67","v":5371},{"$f":"'1a'!M67","v":5213},{"$f":"'1a'!N67","v":5255},{"$f":"'1a'!O67","v":5560},{"$f":"'1a'!P67","v":5999},{"$f":"'1a'!Q67","v":6321},{"$f":"'1a'!R67","v":6945},{"$f":"'1a'!S67","v":7730},{"$f":"'1a'!T67","v":7944},{"$f":"'1a'!U67","v":7890},{"$f":"'1a'!V67","v":7941},{"$f":"'1a'!W67","v":8053},{"$f":"'1a'!X67","v":7936},{"$f":"'1a'!Y67","v":8101},{"$f":"'1a'!Z67","v":7868},{"$f":"'1a'!AA67","v":7569},{"$f":"'1a'!AB67","v":7289},{"$f":"'1a'!AC67","v":7289},{"$f":"AVERAGE(R46:AC46)","v":7524.75},null,{"$f":"SUM(F46:AD46)/CONTROL!$I$3","v":6124.44},null,3497]
[]
[]
[null,"Notes\n1. These figures provide interim management information during the Coronavirus pandemic. Official Statistics with full commentary will be published by SCTS each quarter as normal. \n2. All figures in columns S and U are monthly averages except for the rows showing Trials Scheduled where figures are as at the end of the period shown.\n"]

{"sheet":"2b","index":11,"n_rows":3,"n_cols":2,"rows_kept":3,"cut":false,"hidden":true,"merged":[]}
[]
[]
[null,"Back to Index"]

{"sheet":"Business Trends Chart Data","index":12,"n_rows":27,"n_cols":9,"rows_kept":27,"cut":false,"hidden":true,"merged":[]}
[]
[null,null,null,"Business Trends Chart Data"]
["charts 2b"]
[null,null,"Conversion rate TC to ELT"]
[null,null,"2020-04-01","2020-05-01","2020-06-01","2020-07-01","2020-08-01","2020-09-01","2019/20  monthly average"]
[null,"High Court",{"$f":"'Internal analytics'!F7","v":"n/a"},{"$f":"'Internal analytics'!G7","v":"n/a"},{"$f":"'Internal analytics'!H7","v":"n/a"},{"$f":"'Internal analytics'!I7","v":1},{"$f":"'Internal analytics'!J7","v":1},{"$f":"'Internal analytics'!K7","v":0.69230769230769229},{"$f":"'Internal analytics'!AJ7","v":0.61330049261083741}]
[null,"Sheriff Court - Solemn",{"$f":"'Internal analytics'!F17","v":0},{"$f":"'Internal analytics'!G17","v":0},{"$f":"'Internal analytics'!H17","v":0},{"$f":"'Internal analytics'!I17","v":0},{"$f":"'Internal analytics'!J17","v":0},{"$f":"'Internal analytics'!K17","v":0},{"$f":"'Internal analytics'!AJ17","v":0.36091661362189692}]
[null,"Sheriff Court - Summary",{"$f":"'Internal analytics'!F27","v":6.2344139650872821E-3},{"$f":"'Internal analytics'!G27","v":2.4193548387096774E-2},{"$f":"'Internal analytics'!H27","v":0.15584415584415584},{"$f":"'Internal analytics'!I27","v":0.27147766323024053},{"$f":"'Internal analytics'!J27","v":0.12078531796841656},{"$f":"'Internal analytics'!K27","v":0.14161570646926294},{"$f":"'Internal analytics'!AJ27","v":0.17054187434015075}]
[null,"Justice of the Peace Court - Summary",{"$f":"'Internal analytics'!F39","v":0},{"$f":"'Internal analytics'!G39","v":0},{"$f":"'Internal analytics'!H39","v":0},{"$f":"'Internal analytics'!I39","v":4.3478260869565216E-2},{"$f":"'Internal analytics'!J39","v":7.4675324675324672E-2},{"$f":"'Internal analytics'!K39","v":9.7421203438395415E-2},{"$f":"'Internal analytics'!AJ39","v":0.15336447669217773}]
[]
[]
[]
[null,null,"Ratio of registered to concluded"]
[null,null,"2020-04-01","2020-05-01","2020-06-01","2020-07-01","2020-08-01","2020-09-01","2019/20  monthly average"]
[null,"High Court",{"$f":"'Internal analytics'!F10","v":9.0909090909090912E-2},{"$f":"'Internal analytics'!G10","v":0.10588235294117647},{"$f":"'Internal analytics'!H10","v":0.20289855072463769},{"$f":"'Internal analytics'!I10","v":0.50793650793650791},{"$f":"'Internal analytics'!J10","v":0.76086956521739135},{"$f":"'Internal analytics'!K10","v":0.29411764705882354},{"$f":"'Internal analytics'!AJ10","v":0.78710937500000011}]
[null,"Sheriff Court - Solemn",{"$f":"'Internal analytics'!F20","v":0.63926940639269403},{"$f":"'Internal analytics'!G20","v":0.39811912225705332},{"$f":"'Internal analytics'!H20","v":0.46760563380281689},{"$f":"'Internal analytics'!I20","v":0.37259100642398285},{"$f":"'Internal analytics'!J20","v":0.57258064516129037},{"$f":"'Internal analytics'!K20","v":0.7246963562753036},{"$f":"'Internal analytics'!AJ20","v":0.94552457813646373}]
[null,"Sheriff Court - Summary",{"$f":"'Internal analytics'!F30","v":0.14224137931034483},{"$f":"'Internal analytics'!G30","v":0.22913458577148138},{"$f":"'Internal analytics'!H30","v":0.2659549779531214},{"$f":"'Internal analytics'!I30","v":0.35890410958904112},{"$f":"'Internal analytics'!J30","v":0.67649494782176578},{"$f":"'Internal analytics'!K30","v":0.8128095644748079},{"$f":"'Internal analytics'!AJ30","v":0.87427088105054196}]
[null,"Justice of the Peace Court - Summary",{"$f":"'Internal analytics'!F42","v":5.0150451354062184E-3},{"$f":"'Internal analytics'!G42","v":5.4945054945054944E-2},{"$f":"'Internal analytics'!H42","v":0.1955420466058764},{"$f":"'Internal analytics'!I42","v":0.25178277564454199},{"$f":"'Internal analytics'!J42","v":1.3054511278195489},{"$f":"'Internal analytics'!K42","v":1.9890829694323144},{"$f":"'Internal analytics'!AJ42","v":0.91376332559109041}]
[]
[]
[]
[null,null,"Ration of trials concluded to all concluded"]
[null,null,"2020-04-01","2020-05-01","2020-06-01","2020-07-01","2020-08-01","2020-09-01","2019/20  monthly average"]
[null,"High Court",{"$f":"'Internal analytics'!F11","v":0},{"$f":"'Internal analytics'!G11","v":0},{"$f":"'Internal analytics'!H11","v":0},{"$f":"'Internal analytics'!I11","v":0.125},{"$f":"'Internal analytics'!J11","v":0.31428571428571428},{"$f":"'Internal analytics'!K11","v":0.75},{"$f":"'Internal analytics'!AJ11","v":0.62655086848635233}]
[null,"Sheriff Court - Solemn",{"$f":"'Internal analytics'!F21","v":0.20714285714285716},{"$f":"'Internal analytics'!G21","v":9.4488188976377951E-2},{"$f":"'Internal analytics'!H21","v":4.8192771084337352E-2},{"$f":"'Internal analytics'!I21","v":4.0229885057471264E-2},{"$f":"'Internal analytics'!J21","v":5.6338028169014086E-2},{"$f":"'Internal analytics'!K21","v":3.6312849162011177E-2},{"$f":"'Internal analytics'!AJ21","v":0.45645004849660525}]
[null,"Sheriff Court - Summary",{"$f":"'Internal analytics'!F31","v":7.6923076923076927E-2},{"$f":"'Internal analytics'!G31","v":4.5698924731182797E-2},{"$f":"'Internal analytics'!H31","v":5.4101221640488653E-2},{"$f":"'Internal analytics'!I31","v":9.1603053435114504E-2},{"$f":"'Internal analytics'!J31","v":0.29358472086190007},{"$f":"'Internal analytics'!K31","v":0.34818239125866779},{"$f":"'Internal analytics'!AJ31","v":0.43839946905127852}]
[null,"Justice of the Peace Court - Summary",{"$f":"'Internal analytics'!F43","v":0.1},{"$f":"'Internal analytics'!G43","v":0.06},{"$f":"'Internal analytics'!H43","v":1.5544041450777202E-2},{"$f":"'Internal analytics'!I43","v":2.3965141612200435E-2},{"$f":"'Internal analytics'!J43","v":9.4312455003599707E-2},{"$f":"'Internal analytics'!K43","v":0.19923161361141603},{"$f":"'Internal analytics'!AJ43","v":0.20315453301179692}]

{"sheet":"2","index":13,"n_rows":25,"n_cols":9,"rows_kept":25,"cut":false,"hidden":false,"merged":[[5,4,5,6],[13,4,13,6],[19,4,19,6],[1,0,1,6]]}
[null,"Back to Index"]
["Flowcharts showing showing how criminal cases move through Scotland's courts"]
[]
[]
[]
[null,null,null,null,"Continued Without Plea hearing"]
[]
[null,null,"Summary Case received and registered by the SCTS at either a Sheriff Court or a Justice of the Peace Court",null,"First Calling"," ","Intermediate Diet"," ","Trial Diet"]
[]
[]
[]
[]
[]
[null,null,"Section 76 hearing",null,"Continued First Diet"]
[]
[null,null,"Solemn Case received and registered by the SCTS at a Sheriff Court",null,"First Diet"," ","Trial Diet"," "]
[]
[]
[]
[null,null,"Section 76 hearing",null,"Continued Preliminary Hearing"]
[]
[null,null,"Solemn Case received and registered by the SCTS at the High Court of Justiciary",null,"Preliminary Hearing"," ","Trial Diet"]
[]
[]
["Back to Index"]

{"sheet":"3","index":14,"n_rows":38,"n_cols":2,"rows_kept":38,"cut":false,"hidden":false,"merged":[]}
["Back to Index"]
["Glossary"]
["Accused","A person charged with breaking the law. The term defendant is not used in Scotland"]
["Adjournment  ","An interruption to the proceedings when the court stops the hearing of the case for part of a day or for a longer period."]
["Appeal","An appeal is a re-hearing of a case by a higher court than the court which first heard the case. A re-hearing means re-consideration by the appellate court of the evidence led and the legal issues considered by the court below."]
["Average time between pleading diet and evidence led trial, where evidence led trial occurred in the period shown (weeks)","When an evidence led trial occurs, the trial date can be compared to the pleading diet date to obtain a measure of how long it has taken for the case to come to trial. Many factors can impact on the time between pleading diet and trial diet e.g. court programme capacity, adjournments due to lack of court time, witness availability, parties affected by COVID-19 etc. Where the value is marked as N/A, this means that there were no evidence led trials in the period therefore an average could not be constructed."]
["Complaint  ","A statement accusing someone of breaking the law."]
["Continued First Diet","A date on which an indictment calls in the sheriff court in solemn proceedings to determine whether the prosecutor and defence are ready to go to trial – continued from an earlier First Diet."]
["Continued Preliminary Hearing","A hearing in the High Court of Justiciary in solemn proceedings to decide if the case is ready to go for trial – continued from an earlier Preliminary Hearing. Preliminary legal or factual issues may be determined before trial at a Continued preliminary hearing."]
["Continued without Plea","A further opportunity for a summary case to call in court following no plea having been entered at first calling. "]
["Diet ","The date for a case, for instance, to hear a plea of guilty or not guilty, at an intermediate stage or for a trial."]
["Disposed","The complaint or indictment has been concluded."]
["First calling","The first time a summary case is called in court."]
["First Diet  ","A date on which an indictment calls in the sheriff court in solemn proceedings to determine whether the prosecutor and defence are ready to go to trial."]
["First Instance","The court in which the case was first heard or tried as distinct from second instance which is where a case is appealed.  "]
["Hearing ","Any part of a trial that takes place in a court."]
["Indictment  ","A document setting out the charge(s) of crimes or offences against an accused in more serious cases. A case on indictment is tried by judge sitting with a jury in the High Court (in the most serious cases), or the sheriff court. Cases tried on indictment are known as solemn proceedings."]
["Intermediate diet","A hearing in summary criminal proceedings which allows the court to check whether the case is likely to proceed on the date assigned for trial. The purpose is to minimise inconvenience to witnesses etc. if the trial is adjourned."]
["Jury","A group of lay persons chosen to decide upon issues of fact in legal proceedings. In criminal proceedings, a jury has 15 jurors."]
["Justice of the peace ","A lay magistrate who sits in the justice of the peace court."]
["Lack of Court Time","Cases that are continued to another sitting day due to the sitting day having ended. "]
["Petition ","In criminal proceedings, the Crown (the prosecutor) may begin proceedings by petition before deciding whether to prosecute on indictment or by summary complaint. Only serious cases are begun by petition."]
["Plea ","The answer the accused gives to the court at the pre-trial hearings or at the beginning of a trial when asked if he or she is guilty or not guilty."]
["Pleading Diet","Date assigned for a criminal case to call and for plea to be given, e.g., guilty or not guilty."]
["Preliminary hearing","A hearing in the High Court of Justiciary in solemn proceedings to decide if the case is ready to go for trial. Also preliminary legal or factual issues may be determined before trial at a preliminary hearing."]
["Provisional","A marking applied to statistical data to alert users that the data may be revised in the future and should not be considered as final data."]
["Second Instance","The court in which an appeal is heard as distinct from first instance which is where a case originated.  "]
["Section 76","An accused person charged with a serious offence may give notice in writing that he intends to plead guilty to an indictment under section 76 of the Criminal Procedure (Scotland) Act 1995."]
["Sheriff  ","The name for a judge in the sheriff court."]
["Sheriff and jury ","Cases heard in the sheriff court by a sheriff and jury."]
["Solemn case ","Serious criminal case before a judge and jury in the High Court or sheriff and jury in the sheriff court."]
["Summary case ","Less serious criminal case before a sheriff or justice of the peace, without a jury."]
["Sustained appeal","An appeal that is upheld or granted."]
["Trial  ","The legal action in a criminal court case."]
["Trials called","All trials that have commenced or ‘called’ in court. Some trials will conclude due to a guilty plea being entered before evidence is heard/seen; some trials will be adjourned to a later date and some trials will proceed to hear or see evidence.  "]
["Trials called where evidence was led","A subset of ‘Trials called’ where witnesses give evidence and productions are seen. "]
["Trials scheduled","The count of complaints or indictments that have a trial diet assigned but are yet to call in court."]
[null,"Back to Index"]

{"sheet":"4","index":15,"n_rows":8,"n_cols":2,"rows_kept":8,"cut":false,"hidden":false,"merged":[]}
[]
[null,"Back to Index"]
[]
[]
[]
[]
[]
[null,"  "]

{"sheet":"Sheriffdom Look up","index":16,"n_rows":102,"n_cols":7,"rows_kept":102,"cut":false,"hidden":true,"merged":[[0,6,3,9]]}
["Court Code","Court Name","Court Type","Sheriffdom Code","Sheriffdom Name",null,"This data is only for The Scottish Courts and Tribunals Service Internal use. Please go to the index tab and navigate as required."]
[9701,"ABERDEEN                  ","Sheriff",2,"Grampian, Highland & Islands"]
[9702,"AIRDRIE                   ","Sheriff",5,"South Strathclyde, Dumfries & Galloway"]
[9703,"ALLOA                     ","Sheriff",6,"Tayside, Central & Fife"]
[9704,"AYR                       ","Sheriff",5,"South Strathclyde, Dumfries & Galloway"]
[9705,"ARBROATH                  ","Sheriff",6,"Tayside, Central & Fife"]
[9711,"BANFF                     ","Sheriff",2,"Grampian, Highland & Islands"]
[9716,"CAMPBELTOWN               ","Sheriff",4,"North Strathclyde","NEW COURTS post 14-dec-09"]
[9717,"CUPAR                     ","Sheriff",6,"Tayside, Central & Fife"]
[9721,"DINGWALL                  ","Sheriff",2,"Grampian, Highland & Islands"]
[9722,"DORNOCH                   ","Sheriff",2,"Grampian, Highland & Islands"]
[9723,"DUMBARTON                 ","Sheriff",4,"North Strathclyde"]
[9724,"DUMFRIES                  ","Sheriff",5,"South Strathclyde, Dumfries & Galloway"]
[9726,"DUNDEE                    ","Sheriff",6,"Tayside, Central & Fife"]
[9727,"DUNFERMLINE               ","Sheriff",6,"Tayside, Central & Fife"]
[9728,"DUNOON                    ","Sheriff",4,"North Strathclyde"]
[9729,"DUNS                      ","Sheriff",3,"Lothian & Borders"]
[9741,"EDINBURGH                 ","Sheriff",3,"Lothian & Borders"]
[9742,"ELGIN                     ","Sheriff",2,"Grampian, Highland & Islands"]
[9751,"FALKIRK                   ","Sheriff",6,"Tayside, Central & Fife"]
[9752,"FORFAR                    ","Sheriff",6,"Tayside, Central & Fife"]
[9753,"FORT WILLIAM              ","Sheriff",2,"Grampian, Highland & Islands"]
[9761,"GLASGOW                   ","Sheriff",1,"Glasgow & Strathkelvin"]
[9762,"GREENOCK                  ","Sheriff",4,"North Strathclyde"]
[9771,"HADDINGTON                ","Sheriff",3,"Lothian & Borders"]
[9772,"HAMILTON                  ","Sheriff",5,"South Strathclyde, Dumfries & Galloway"]
[9781,"INVERNESS                 ","Sheriff",2,"Grampian, Highland & Islands"]
[9791,"JEDBURGH                  ","Sheriff",3,"Lothian & Borders"]
[9801,"KILMARNOCK                ","Sheriff",4,"North Strathclyde"]
[9803,"KIRKCALDY                 ","Sheriff",6,"Tayside, Central & Fife"]
[9804,"KIRKCUDBRIGHT             ","Sheriff",5,"South Strathclyde, Dumfries & Galloway"]
[9805,"KIRKWALL                  ","Sheriff",2,"Grampian, Highland & Islands"]
[9811,"LANARK                    ","Sheriff",5,"South Strathclyde, Dumfries & Galloway"]
[9812,"LERWICK                   ","Sheriff",2,"Grampian, Highland & Islands"]
[9814,"LOCHMADDY                 ","Sheriff",2,"Grampian, Highland & Islands"]
[9815,"LIVINGSTON                ","Sheriff",null,"Lothian & Borders"]
[9841,"OBAN                      ","Sheriff",4,"North Strathclyde"]
[9851,"PAISLEY                   ","Sheriff",4,"North Strathclyde"]
[9852,"PEEBLES                   ","Sheriff",3,"Lothian & Borders"]
[9853,"PERTH                     ","Sheriff",6,"Tayside, Central & Fife"]
[9854,"PETERHEAD                 ","Sheriff",2,"Grampian, Highland & Islands"]
[9855,"PORTREE                   ","Sheriff",2,"Grampian, Highland & Islands"]
[9861,"ROTHESAY                  ","Sheriff",4,"North Strathclyde"]
[9871,"SELKIRK                   ","Sheriff",3,"Lothian & Borders"]
[9872,"STIRLING                  ","Sheriff",6,"Tayside, Central & Fife"]
[9873,"STONEHAVEN                ","Sheriff",2,"Grampian, Highland & Islands"]
[9874,"STORNOWAY                 ","Sheriff",2,"Grampian, Highland & Islands"]
[9875,"STRANRAER                 ","Sheriff",5,"South Strathclyde, Dumfries & Galloway"]
[9881,"TAIN                      ","Sheriff",2,"Grampian, Highland & Islands"]
[9891,"WICK                      ","Sheriff",2,"Grampian, Highland & Islands"]
[9251,"ABERDEEN                  ","JP",2,"Grampian, Highland & Islands"]
[9240,"ALLOA                     ","JP",6,"Tayside, Central & Fife"]
[9245,"ANNAN                     ","JP",5,"South Strathclyde, Dumfries & Galloway"]
[9263,"ARBROATH                  ","JP",6,"Tayside, Central & Fife"]
[9360,"AYR                       ","JP",5,"South Strathclyde, Dumfries & Galloway"]
[9252,"BANFF                     ","JP",2,"Grampian, Highland & Islands"]
[9289,"CAMPBELTOWN               ","JP",4,"North Strathclyde"]
[9355,"AIRDRIE","JP",5,"South Strathclyde, Dumfries & Galloway"]
[9356,"CUMBERNAULD               ","JP",5,"South Strathclyde, Dumfries & Galloway"]
[9285,"CUPAR                     ","JP",6,"Tayside, Central & Fife"]
[9343,"DINGWALL                  ","JP",2,"Grampian, Highland & Islands"]
[9344,"DORNOCH                   ","JP",2,"Grampian, Highland & Islands"]
[9376,"DUMBARTON                 ","JP",4,"North Strathclyde"]
[9246,"DUMFRIES                  ","JP",5,"South Strathclyde, Dumfries & Galloway"]
[9256,"DUNDEE                    ","JP",6,"Tayside, Central & Fife"]
[9286,"DUNFERMLINE               ","JP",6,"Tayside, Central & Fife"]
[9290,"DUNOON                    ","JP",4,"North Strathclyde"]
[9350,"DUNS                      ","JP",3,"Lothian & Borders"]
[9278,"EDINBURGH                 ","JP",3,"Lothian & Borders"]
[9341,"ELGIN                     ","JP",2,"Grampian, Highland & Islands"]
[9282,"FALKIRK                   ","JP",6,"Tayside, Central & Fife"]
[9264,"FORFAR                    ","JP",6,"Tayside, Central & Fife"]
[9345,"FORT WILLIAM              ","JP",2,"Grampian, Highland & Islands"]
[9295,"GLASGOW                   ","JP",1,"Glasgow & Strathkelvin"]
[9340,"GREENOCK                  ","JP",4,"North Strathclyde"]
[9270,"HADDINGTON                ","JP",3,"Lothian & Borders"]
[9366,"HAMILTON                  ","JP",5,"South Strathclyde, Dumfries & Galloway"]
[9346,"INVERNESS                 ","JP",2,"Grampian, Highland & Islands"]
[9354,"IRVINE                    ","JP",4,"North Strathclyde"]
[9351,"JEDBURGH                  ","JP",3,"Lothian & Borders"]
[9261,"KILMARNOCK                ","JP",4,"North Strathclyde"]
[9287,"KIRKCALDY                 ","JP",6,"Tayside, Central & Fife"]
[9247,"KIRKCUDBRIGHT             ","JP",5,"South Strathclyde, Dumfries & Galloway"]
[9367,"LANARK                    ","JP",5,"South Strathclyde, Dumfries & Galloway"]
[9380,"LIVINGSTON                ","JP",3,"Lothian & Borders"]
[9292,"LOCHGILPHEAD              ","JP",4,"North Strathclyde"]
[9357,"MOTHERWELL                ","JP",5,"South Strathclyde, Dumfries & Galloway"]
[9293,"OBAN                      ","JP",4,"North Strathclyde"]
[9342,"PAISLEY                   ","JP",4,"North Strathclyde"]
[9352,"PEEBLES                   ","JP",3,"Lothian & Borders"]
[9358,"PERTH                     ","JP",6,"Tayside, Central & Fife"]
[9253,"PETERHEAD                 ","JP",2,"Grampian, Highland & Islands"]
[9347,"PORTREE                   ","JP",2,"Grampian, Highland & Islands"]
[9353,"SELKIRK                   ","JP",3,"Lothian & Borders"]
[9372,"STIRLING                  ","JP",6,"Tayside, Central & Fife"]
[9254,"STONEHAVEN                ","JP",2,"Grampian, Highland & Islands"]
[9384,"STORNOWAY                 ","JP",2,"Grampian, Highland & Islands"]
[9250,"STRANRAER                 ","JP",5,"South Strathclyde, Dumfries & Galloway"]
[9348,"TAIN                      ","JP",2,"Grampian, Highland & Islands"]
[9349,"WICK                      ","JP",2,"Grampian, Highland & Islands"]
[1,"National ","JP",null,"National JP"]
[0,"National ","SC",null,"National SC"]