{"text_format":"1","workbook":"xlsx","n_sheets":17,"sheets":["CONTROL","Index","1a","National Overview Chart Data","1b","High Court Raw Data","High Court Chart Data","JP SC Raw Data","FY lookup","Sheriff Court lookup","Internal analytics","2b","Business Trends Chart Data","2","3","4","Sheriffdom Look up"],"not_rendered":{"charts":9,"images":8,"macros":1,"external_links":0,"defined_names":4,"comments":1,"pivot_tables":0},"unopened":[],"bounds":{"document_bytes":16777216,"sheet_cells":100000,"rows_first":2000,"rows_last":500,"rows_between":2000,"halvings":0,"cell_chars":16384,"cell_head_chars":4096},"cells_cut":0,"cells_raw":0,"read":"whole","date_system":"1900"}

{"sheet":"CONTROL","index":0,"n_rows":5,"n_cols":9,"rows_kept":5,"cut":false,"hidden":true,"merged":[]}
[]
[]
[null,null,null,null,null,null,null,"Month for division",25]
[]
[null,null,null,null,null,null,null,"Month of FY",1]

{"sheet":"Index","index":1,"n_rows":15,"n_cols":5,"rows_kept":15,"cut":false,"hidden":false,"merged":[[1,0,1,2]]}
[" "]
["Management Information showing interim monthly business volumes and trends for first instance criminal cases calling at Scottish courts during the Coronavirus pandemic. Official Statistics with full commentary are published quarterly."]
[]
["Table","Charts","Description ",null,"Geography"]
[]
["1a","1b","Time series of business volumes ",null,"National data"]
{"$rows_left_out":10}
{"sheet":"1a","index":2,"n_rows":69,"n_cols":32,"rows_kept":69,"cut":false,"hidden":false,"merged":[[68,1,82,2],[3,1,14,1],[43,1,54,1],[56,1,67,1],[1,3,1,14],[0,5,0,6],[2,1,2,2],[16,1,27,1],[29,1,41,1]]}
[null,null,null,null,null,"Back to Index"]
[]
[null,"National overview of criminal court cases in Scotland",null,"2020-04-01","2020-05-01","2020-06-01","2020-07-01","2020-08-01","2020-09-01","2020-10-01","2020-11-01","2020-12-01","2021-01-01","2021-02-01","2021-03-01","2021-04-01","2021-05-01","2021-06-01","2021-07-01","2021-08-01","2021-09-01","2021-10-01","2021-11-01","2021-12-01","2022-01-01","2022-02-01","2022-03-01","2022-04-01","2022/23 YTD",null,"2019/20","2019/20  monthly average"]
[null,"All Criminal courts","National total of cases registered (not including petitions) ",{"$f":"IF(SUM(D17,D31,D44,D57)=0,\"\",(SUM(D17,D31,D44,D57)))","v":5306},4561,5720,8558,7643,7333,6903,6050,5858,5703,5465,7560,7505,6909,7136,6743,7214,7124,7166,7399,7235,6894,6233,8009,{"$f":"IF(SUM(AB17,AB31,AB44,AB57)=0,\"\",(SUM(AB17,AB31,AB44,AB57)))","v":6814},{"$f":"SUM(AB4)","v":6814},null,{"$f":"SUM(AE17,AE31,AE44,AE57)","v":105548},{"$f":"AE4/12","v":8795.6666666666661}]
[null,null,"National total of cases that called at a first hearing",{"$f":"IF(SUM(D18,D32,D45,D58)=0,\"\",(SUM(D18,D32,D45,D58)))","v":3401},3843,3864,8401,7799,7040,6641,5861,6020,6013,4012,6596,6058,5829,6663,7111,6837,6856,7018,7141,7151,6998,5441,7885,{"$f":"IF(SUM(AB18,AB32,AB45,AB58)=0,\"\",(SUM(AB18,AB32,AB45,AB58)))","v":6937},{"$f":"SUM(AB5)","v":6937},null,{"$f":"SUM(AE18,AE32,AE45,AE58)","v":100922},{"$f":"AE5/12","v":8410.1666666666661}]
[null,null,"National total of cases that called at a continued first hearing",{"$f":"IF(SUM(D19,D33,D46,D59)=0,\"\",(SUM(D19,D33,D46,D59)))","v":2023},2320,2724,3896,7105,8751,7686,6799,6372,5434,2421,4453,4541,6260,7980,8583,6724,5455,4575,4610,4377,4252,4621,4249,{"$f":"IF(SUM(AB19,AB33,AB46,AB59)=0,\"\",(SUM(AB19,AB33,AB46,AB59)))","v":4570},4570,null,{"$f":"SUM(AE19,AE33,AE46,AE59)","v":36514},{"$f":"AE6/12","v":3042.8333333333335}]
{"$rows_left_out":64}
{"sheet":"National Overview Chart Data","index":3,"n_rows":68,"n_cols":28,"rows_kept":68,"cut":false,"hidden":true,"merged":[[67,0,69,0]]}
["National overview chart data"]
[]
["Cases Registered",{"$f":"'1a'!D3","v":"2020-04-01"},{"$f":"'1a'!E3","v":"2020-05-01"},{"$f":"'1a'!F3","v":"2020-06-01"},{"$f":"'1a'!G3","v":"2020-07-01"},{"$f":"'1a'!H3","v":"2020-08-01"},{"$f":"'1a'!I3","v":"2020-09-01"},{"$f":"'1a'!J3","v":"2020-10-01"},{"$f":"'1a'!K3","v":"2020-11-01"},{"$f":"'1a'!L3","v":"2020-12-01"},{"$f":"'1a'!M3","v":"2021-01-01"},{"$f":"'1a'!N3","v":"2021-02-01"},{"$f":"'1a'!O3","v":"2021-03-01"},{"$f":"'1a'!P3","v":"2021-04-01"},{"$f":"'1a'!Q3","v":"2021-05-01"},{"$f":"'1a'!R3","v":"2021-06-01"},{"$f":"'1a'!S3","v":"2021-07-01"},{"$f":"'1a'!T3","v":"2021-08-01"},{"$f":"'1a'!U3","v":"2021-09-01"},{"$f":"'1a'!V3","v":"2021-10-01"},{"$f":"'1a'!W3","v":"2021-11-01"},{"$f":"'1a'!X3","v":"2021-12-01"},{"$f":"'1a'!Y3","v":"2022-01-01"},{"$f":"'1a'!Z3","v":"2022-02-01"},{"$f":"'1a'!AA3","v":"2022-03-01"},{"$f":"'1a'!AB3","v":"2022-04-01"},"2019/20 monthly average","2020/21 YTD"]
["National",{"$f":"'1a'!D4","v":5306},{"$f":"'1a'!E4","v":4561},{"$f":"'1a'!F4","v":5720},{"$f":"'1a'!G4","v":8558},{"$f":"'1a'!H4","v":7643},{"$f":"'1a'!I4","v":7333},{"$f":"'1a'!J4","v":6903},{"$f":"'1a'!K4","v":6050},{"$f":"'1a'!L4","v":5858},{"$f":"'1a'!M4","v":5703},{"$f":"'1a'!N4","v":5465},{"$f":"'1a'!O4","v":7560},{"$f":"'1a'!P4","v":7505},{"$f":"'1a'!Q4","v":6909},{"$f":"'1a'!R4","v":7136},{"$f":"'1a'!S4","v":6743},{"$f":"'1a'!T4","v":7214},{"$f":"'1a'!U4","v":7124},{"$f":"'1a'!V4","v":7166},{"$f":"'1a'!W4","v":7399},{"$f":"'1a'!X4","v":7235},{"$f":"'1a'!Y4","v":6894},{"$f":"'1a'!Z4","v":6233},{"$f":"'1a'!AA4","v":8009},{"$f":"'1a'!AB4","v":6814},{"$f":"'1a'!AF4","v":8795.6666666666661}]
["High Court",{"$f":"'1a'!D17","v":77},{"$f":"'1a'!E17","v":85},{"$f":"'1a'!F17","v":69},{"$f":"'1a'!G17","v":63},{"$f":"'1a'!H17","v":46},{"$f":"'1a'!I17","v":68},{"$f":"'1a'!J17","v":60},{"$f":"'1a'!K17","v":32},{"$f":"'1a'!L17","v":48},{"$f":"'1a'!M17","v":65},{"$f":"'1a'!N17","v":64},{"$f":"'1a'!O17","v":90},{"$f":"'1a'!P17","v":55},{"$f":"'1a'!Q17","v":43},{"$f":"'1a'!R17","v":57},{"$f":"'1a'!S17","v":66},{"$f":"'1a'!T17","v":37},{"$f":"'1a'!U17","v":57},{"$f":"'1a'!V17","v":69},{"$f":"'1a'!W17","v":54},{"$f":"'1a'!X17","v":69},{"$f":"'1a'!Y17","v":68},{"$f":"'1a'!Z17","v":90},{"$f":"'1a'!AA17","v":80},{"$f":"'1a'!AB17","v":77},{"$f":"'1a'!AF17","v":85.333333333333329}]
["Sheriff Court - Solemn",{"$f":"'1a'!D31","v":219},{"$f":"'1a'!E31","v":319},{"$f":"'1a'!F31","v":355},{"$f":"'1a'!G31","v":467},{"$f":"'1a'!H31","v":496},{"$f":"'1a'!I31","v":494},{"$f":"'1a'!J31","v":492},{"$f":"'1a'!K31","v":414},{"$f":"'1a'!L31","v":428},{"$f":"'1a'!M31","v":379},{"$f":"'1a'!N31","v":378},{"$f":"'1a'!O31","v":410},{"$f":"'1a'!P31","v":441},{"$f":"'1a'!Q31","v":532},{"$f":"'1a'!R31","v":471},{"$f":"'1a'!S31","v":520},{"$f":"'1a'!T31","v":447},{"$f":"'1a'!U31","v":481},{"$f":"'1a'!V31","v":479},{"$f":"'1a'!W31","v":541},{"$f":"'1a'!X31","v":450},{"$f":"'1a'!Y31","v":425},{"$f":"'1a'!Z31","v":525},{"$f":"'1a'!AA31","v":447},{"$f":"'1a'!AB31","v":421},{"$f":"'1a'!AF30","v":815}]
{"$rows_left_out":63}
{"sheet":"1b","index":4,"n_rows":63,"n_cols":4,"rows_kept":63,"cut":false,"hidden":false,"merged":[[63,3,63,14],[25,28,25,39]]}
[]
[null,"Back to Index"]
[]
[]
[]
[]
{"$rows_left_out":58}
{"sheet":"High Court Raw Data","index":5,"n_rows":7,"n_cols":23,"rows_kept":7,"cut":false,"hidden":true,"merged":[]}
["This data is only for The Scottish Courts and Tribunals Service Internal use. Please go to the index tab and navigate as required."]
["FINANCIAL_YEAR","QUARTER","COURT_REF","COURT_NAME","INDICTMENTS_REG","INDICTMENTS_PH","INDICTMENTS_CALLED_CPH","S76_INDICTMENTS","TRIALS_CALLED","TRIALS_ELED","TRIALS_LOCT","TRIALS_OUTSTANDING","SOL_CASES_FULLY_DISPOSED",null,null,"Current Year","Current Quarter"]
["2019/20","Q1",2,"HIGH CT",248,253,100,25,168,107,5,315,182,null,null,{"$f":"LOOKUP(2,1/($A:$A<>\"\"),$A:$A)","v":"2020/21"},{"$f":"LOOKUP(2,1/($B:$B<>\"\"),$B:$B)","v":"Q1"},null,"2019/20","Q4",null,"2018/19","Q4"]
["2019/20","Q2",2,"HIGH CT",272,241,114,22,219,146,4,304,241]
["2019/20","Q3",2,"HIGH CT",274,267,115,24,190,120,22,369,206]
["2019/20","Q4",2,"HIGH CT",230,220,108,23,235,125,18,390,177]
{"$rows_left_out":2}
{"sheet":"High Court Chart Data","index":6,"n_rows":10,"n_cols":15,"rows_kept":10,"cut":false,"hidden":true,"merged":[]}
["Financial Year","QUARTER","COURT_REF","COURT","INDICTMENTS_REG","INDICTMENTS_PH","INDICTMENTS_CALLED_CPH","S76_INDICTMENTS","TRIALS_CALLED","TRIALS_ELED","TRIALS_LOCT","% LOCT1","TRIALS_OUTSTANDING","SOL_CASES_FULLY_DISPOSED","% LOCT"]
["2019/20","Q1",2,"HIGH CT",248,253,100,25,168,107,5,{"$f":"IFERROR(HighChart[[#This Row],[TRIALS_LOCT]]/HighChart[[#This Row],[TRIALS_CALLED]],NA())","v":2.976190476190476E-2},315,182,{"$f":"IF(I2=0,0,K2/I2)","v":2.976190476190476E-2}]
["2019/20","Q2",2,"HIGH CT",272,241,114,22,219,146,4,{"$f":"IFERROR(HighChart[[#This Row],[TRIALS_LOCT]]/HighChart[[#This Row],[TRIALS_CALLED]],NA())","v":1.8264840182648401E-2},304,241,1.8264840182648401E-2]
["2019/20","Q3",2,"HIGH CT",274,267,115,24,190,120,22,{"$f":"IFERROR(HighChart[[#This Row],[TRIALS_LOCT]]/HighChart[[#This Row],[TRIALS_CALLED]],NA())","v":0.11578947368421053},369,206,0.11578947368421053]
["2019/20","Q4",2,"HIGH CT",230,220,108,23,235,125,18,{"$f":"IFERROR(HighChart[[#This Row],[TRIALS_LOCT]]/HighChart[[#This Row],[TRIALS_CALLED]],NA())","v":7.6595744680851063E-2},390,177,7.6595744680851063E-2]
["2020/21 YTD","Q1",2,"HIGH CT",231,92,40,17,0,0,0,{"$f":"IFERROR(HighChart[[#This Row],[TRIALS_LOCT]]/HighChart[[#This Row],[TRIALS_CALLED]],NA())","v":{"$error":"#N/A"}},390,30,0]
{"$rows_left_out":5}
{"sheet":"JP SC Raw Data","index":7,"n_rows":378,"n_cols":34,"rows_kept":378,"cut":false,"hidden":true,"merged":[]}
[null,"This data is only for The Scottish Courts and Tribunals Service Internal use. Please go to the index tab and navigate as required.",null,null,null,null,null,null,null,null,null,null,null,null,null,null,null,null,null,null,null,null,null,null,null,null,"Current Year","Current Quarter",null,"Previous year 2019/20",null,null,"Previous year 2018/19"]
[null,null,null,null,null,null,null,null,null,null,null,null,null,null,null,null,null,null,null,null,null,null,null,null,null,null,{"$f":"LOOKUP(2,1/($B:$B<>\"\"),$B:$B)","v":"2020/21"},{"$f":"LOOKUP(2,1/($C:$C<>\"\"),$C:$C)","v":"Q1"},null,"2019/20","Q4",null,"2018/19","Q4"]
["Sheriffdom","FINANCIAL_YEAR","QUARTER","COURT_REF","COURT_NAME","COURT_TYPE","SOL_PETITIONS","SOL_INDICTMENTS_REGISTERED","SOL_FIRST_DIET","SOL_CONT_FD","SOL_S76","SOL_TRIALS_CALLED","SOL_TRIAL_ELED","SOL_LOCT","SOL_OUTSTANDING_INDICTMENTS","SOL_CASES_FULLY_DISPOSED","SUM_COMPLAINTS_REGISTERED","SUM_CALLED_FOR_FIRST_TIME","SUM_CWP_HEARING","SUM_INTERMEDIATE_DIET","SUM_TRIALS_CALLED","SUM_TRIAL_ELED","SUM_LOCT","SUM_OUTSTANDING_COMPLAINTS","SUM_CASES_FULLY_DISPOSED"]
[{"$f":"VLOOKUP(D4,'Sheriffdom Look up'!$A$1:$E$102,5,FALSE)","v":"National JP"},"2019/20","Q1",1,"NATIONAL","J",0,0,0,0,0,0,0,0,0,0,7496,7329,4505,5139,2668,438,43,3640,7288]
[{"$f":"VLOOKUP(D5,'Sheriffdom Look up'!$A$1:$E$102,5,FALSE)","v":"National SC"},"2019/20","Q1",0,"NATIONAL","S",2502,1385,1241,699,246,835,299,19,449,1282,15912,15203,3666,16190,9818,1832,345,12088,14291]
[{"$f":"VLOOKUP(D6,'Sheriffdom Look up'!$A$1:$E$102,5,FALSE)","v":"Tayside, Central & Fife"},"2019/20","Q1",9240,"ALLOA","J",0,0,0,0,0,0,0,0,0,0,41,35,50,40,14,4,0,18,46]
{"$rows_left_out":373}
{"sheet":"FY lookup","index":8,"n_rows":12,"n_cols":9,"rows_kept":12,"cut":false,"hidden":true,"merged":[[0,8,7,12]]}
["2013-04-01","2014-03-01","2013/14",null,null,4,"Q1",null,"This data is only for The Scottish Courts and Tribunals Service Internal use. Please go to the index tab and navigate as required."]
["2014-04-01","2015-03-01","2014/15",null,null,5,"Q1"]
["2015-04-01","2016-03-01","2015/16",null,null,6,"Q1"]
["2016-04-01","2017-03-01","2016/17",null,null,7,"Q2"]
["2017-04-01","2018-03-01","2017/18",null,null,8,"Q2"]
[null,null,null,null,null,9,"Q2"]
{"$rows_left_out":7}
{"sheet":"Sheriff Court lookup","index":9,"n_rows":58,"n_cols":8,"rows_kept":58,"cut":false,"hidden":true,"merged":[[0,10,3,13],[1,3,7,5]]}
[null,"Court Name","Court Code",null,null,null,"Court Name","Court Code"]
[null,"National",0,"This data is only for The Scottish Courts and Tribunals Service Internal use. Please go to the index tab and navigate as required.",null,null,"National",1]
[null,"Glasgow & Strathkelvin",null,null,null,null,"Glasgow & Strathkelvin"]
[null,"Grampian, Highland & Islands",null,null,null,null,"Grampian, Highland & Islands"]
[null,"Lothian & Borders",null,null,null,null,"Lothian & Borders"]
[null,"North Strathclyde",null,null,null,null,"North Strathclyde"]
{"$rows_left_out":53}
{"sheet":"Internal analytics","index":10,"n_rows":49,"n_cols":36,"rows_kept":49,"cut":false,"hidden":true,"merged":[[48,1,56,2],[0,7,0,8],[2,1,2,2],[47,1,47,11],[3,1,11,1],[13,1,21,1],[23,1,33,1],[35,1,45,1]]}
[null,null,null,null,null,null,null,"Back to Index"]
[null,null,null,null,null,null,null,null,null,null,null,null,null,null,null,null,null,null,null,null,null,null,null,null,null,null,null,null,null,null,null,null,null,"Pandemic",null,"Pre-Pandemic"]
[null,"Monitoring criminal business trends during the Coronavirus pandemic",null,null,null,"2020-04-01","2020-05-01","2020-06-01","2020-07-01","2020-08-01","2020-09-01","2020-10-01","2020-11-01","2020-12-01","2021-01-01","2021-02-01","2021-03-01","2021-04-01","2021-05-01","2021-06-01","2021-07-01","2021-08-01","2021-09-01","2021-10-01","2021-11-01","2021-12-01","2022-01-01","2022-02-01","2022-03-01","2022-04-01","2022/23","2022/23 monthly average",null,"2020/22 monthly average ",null,"2019/20  monthly average"]
[null,"High Court ","Indictments Registered",{"$f":"SUMIFS(#REF!,#REF!,#REF!,#REF!,\"NATIONAL\")","v":{"$error":"#REF!"}},null,{"$f":"IF('1a'!D17=0,\"\",'1a'!D17)","v":77},{"$f":"IF('1a'!E17=0,\"\",'1a'!E17)","v":85},{"$f":"IF('1a'!F17=0,\"\",'1a'!F17)","v":69},{"$f":"IF('1a'!G17=0,\"\",'1a'!G17)","v":63},{"$f":"IF('1a'!H17=0,\"\",'1a'!H17)","v":46},{"$f":"IF('1a'!I17=0,\"\",'1a'!I17)","v":68},{"$f":"IF('1a'!J17=0,\"\",'1a'!J17)","v":60},{"$f":"IF('1a'!K17=0,\"\",'1a'!K17)","v":32},{"$f":"IF('1a'!L17=0,\"\",'1a'!L17)","v":48},{"$f":"IF('1a'!M17=0,\"\",'1a'!M17)","v":65},{"$f":"IF('1a'!N17=0,\"\",'1a'!N17)","v":64},{"$f":"IF('1a'!O17=0,\"\",'1a'!O17)","v":90},{"$f":"IF('1a'!P17=0,\"\",'1a'!P17)","v":55},{"$f":"IF('1a'!Q17=0,\"\",'1a'!Q17)","v":43},{"$f":"IF('1a'!R17=0,\"\",'1a'!R17)","v":57},{"$f":"IF('1a'!S17=0,\"\",'1a'!S17)","v":66},{"$f":"IF('1a'!T17=0,\"\",'1a'!T17)","v":37},{"$f":"IF('1a'!U17=0,\"\",'1a'!U17)","v":57},{"$f":"IF('1a'!V17=0,\"\",'1a'!V17)","v":69},{"$f":"IF('1a'!W17=0,\"\",'1a'!W17)","v":54},{"$f":"IF('1a'!X17=0,\"\",'1a'!X17)","v":69},{"$f":"IF('1a'!Y17=0,\"\",'1a'!Y17)","v":68},{"$f":"IF('1a'!Z17=0,\"\",'1a'!Z17)","v":90},{"$f":"IF('1a'!AA17=0,\"\",'1a'!AA17)","v":80},{"$f":"IF('1a'!AB17=0,\"\",'1a'!AB17)","v":77},{"$f":"IF('1a'!AC17=0,\"\",'1a'!AC17)","v":77},{"$f":"AE4/CONTROL!I5","v":77},null,{"$f":"SUM(F4:AD4)/CONTROL!I3","v":63.56},null,{"$f":"'1a'!AF17","v":85.333333333333329}]
[null,null,"Trials Called (TC)",{"$f":"SUMIFS(#REF!,#REF!,#REF!,#REF!,\"NATIONAL\")","v":{"$error":"#REF!"}},null,{"$f":"'1a'!D21","v":0},{"$f":"'1a'!E21","v":0},{"$f":"'1a'!F21","v":0},{"$f":"'1a'!G21","v":4},{"$f":"'1a'!H21","v":14},{"$f":"'1a'!I21","v":26},{"$f":"'1a'!J21","v":42},{"$f":"IF('1a'!K21=0,\"\",'1a'!K21)","v":58},{"$f":"IF('1a'!L21=0,\"\",'1a'!L21)","v":47},{"$f":"IF('1a'!M21=0,\"\",'1a'!M21)","v":56},{"$f":"IF('1a'!N21=0,\"\",'1a'!N21)","v":67},{"$f":"IF('1a'!O21=0,\"\",'1a'!O21)","v":66},{"$f":"IF('1a'!P21=0,\"\",'1a'!P21)","v":46},{"$f":"IF('1a'!Q21=0,\"\",'1a'!Q21)","v":60},{"$f":"IF('1a'!R21=0,\"\",'1a'!R21)","v":67},{"$f":"IF('1a'!S21=0,\"\",'1a'!S21)","v":58},{"$f":"IF('1a'!T21=0,\"\",'1a'!T21)","v":74},{"$f":"IF('1a'!U21=0,\"\",'1a'!U21)","v":64},{"$f":"IF('1a'!V21=0,\"\",'1a'!V21)","v":65},{"$f":"IF('1a'!W21=0,\"\",'1a'!W21)","v":81},{"$f":"IF('1a'!X21=0,\"\",'1a'!X21)","v":38},{"$f":"IF('1a'!Y21=0,\"\",'1a'!Y21)","v":62},{"$f":"IF('1a'!Z21=0,\"\",'1a'!Z21)","v":64},{"$f":"IF('1a'!AA21=0,\"\",'1a'!AA21)","v":73},{"$f":"IF('1a'!AB21=0,\"\",'1a'!AB21)","v":73},{"$f":"IF('1a'!AC21=0,\"\",'1a'!AC21)","v":73},{"$f":"AE5/CONTROL!I5","v":73},null,{"$f":"SUM(F5:AD5)/CONTROL!I3","v":48.2},null,{"$f":"'1a'!AF21","v":67.666666666666671}]
[null,null,"Evidence Led Trials (ELT)",{"$f":"SUMIFS(#REF!,#REF!,#REF!,#REF!,\"NATIONAL\")","v":{"$error":"#REF!"}},null,{"$f":"'1a'!D22","v":0},{"$f":"'1a'!E22","v":0},{"$f":"'1a'!F22","v":0},{"$f":"'1a'!G22","v":4},{"$f":"'1a'!H22","v":14},{"$f":"'1a'!I22","v":18},{"$f":"'1a'!J22","v":28},{"$f":"IF('1a'!K22=0,\"\",'1a'!K22)","v":49},{"$f":"IF('1a'!L22=0,\"\",'1a'!L22)","v":29},{"$f":"IF('1a'!M22=0,\"\",'1a'!M22)","v":43},{"$f":"IF('1a'!N22=0,\"\",'1a'!N22)","v":42},{"$f":"IF('1a'!O22=0,\"\",'1a'!O22)","v":51},{"$f":"IF('1a'!P22=0,\"\",'1a'!P22)","v":34},{"$f":"IF('1a'!Q22=0,\"\",'1a'!Q22)","v":43},{"$f":"IF('1a'!R22=0,\"\",'1a'!R22)","v":47},{"$f":"IF('1a'!S22=0,\"\",'1a'!S22)","v":48},{"$f":"IF('1a'!T22=0,\"\",'1a'!T22)","v":55},{"$f":"IF('1a'!U22=0,\"\",'1a'!U22)","v":47},{"$f":"IF('1a'!V22=0,\"\",'1a'!V22)","v":54},{"$f":"IF('1a'!W22=0,\"\",'1a'!W22)","v":63},{"$f":"IF('1a'!X22=0,\"\",'1a'!X22)","v":30},{"$f":"IF('1a'!Y22=0,\"\",'1a'!Y22)","v":47},{"$f":"IF('1a'!Z22=0,\"\",'1a'!Z22)","v":54},{"$f":"IF('1a'!AA22=0,\"\",'1a'!AA22)","v":55},{"$f":"IF('1a'!AB22=0,\"\",'1a'!AB22)","v":50},{"$f":"IF('1a'!AC22=0,\"\",'1a'!AC22)","v":50},{"$f":"AE6/CONTROL!I5","v":50},null,{"$f":"SUM(F6:AD6)/CONTROL!I3","v":36.200000000000003},null,{"$f":"'1a'!AF22","v":41.5}]
{"$rows_left_out":44}
{"sheet":"2b","index":11,"n_rows":3,"n_cols":2,"rows_kept":3,"cut":false,"hidden":true,"merged":[]}
[]
[]
[null,"Back to Index"]

{"sheet":"Business Trends Chart Data","index":12,"n_rows":27,"n_cols":9,"rows_kept":27,"cut":false,"hidden":true,"merged":[]}
[]
[null,null,null,"Business Trends Chart Data"]
["charts 2b"]
[null,null,"Conversion rate TC to ELT"]
[null,null,"2020-04-01","2020-05-01","2020-06-01","2020-07-01","2020-08-01","2020-09-01","2019/20  monthly average"]
[null,"High Court",{"$f":"'Internal analytics'!F7","v":"n/a"},{"$f":"'Internal analytics'!G7","v":"n/a"},{"$f":"'Internal analytics'!H7","v":"n/a"},{"$f":"'Internal analytics'!I7","v":1},{"$f":"'Internal analytics'!J7","v":1},{"$f":"'Internal analytics'!K7","v":0.69230769230769229},{"$f":"'Internal analytics'!AJ7","v":0.61330049261083741}]
{"$rows_left_out":22}
{"sheet":"2","index":13,"n_rows":25,"n_cols":9,"rows_kept":25,"cut":false,"hidden":false,"merged":[[5,4,5,6],[13,4,13,6],[19,4,19,6],[1,0,1,6]]}
[null,"Back to Index"]
["Flowcharts showing showing how criminal cases move through Scotland's courts"]
[]
[]
[]
[null,null,null,null,"Continued Without Plea hearing"]
{"$rows_left_out":20}
{"sheet":"3","index":14,"n_rows":38,"n_cols":2,"rows_kept":38,"cut":false,"hidden":false,"merged":[]}
["Back to Index"]
["Glossary"]
["Accused","A person charged with breaking the law. The term defendant is not used in Scotland"]
["Adjournment  ","An interruption to the proceedings when the court stops the hearing of the case for part of a day or for a longer period."]
["Appeal","An appeal is a re-hearing of a case by a higher court than the court which first heard the case. A re-hearing means re-consideration by the appellate court of the evidence led and the legal issues considered by the court below."]
["Average time between pleading diet and evidence led trial, where evidence led trial occurred in the period shown (weeks)","When an evidence led trial occurs, the trial date can be compared to the pleading diet date to obtain a measure of how long it has taken for the case to come to trial. Many factors can impact on the time between pleading diet and trial diet e.g. court programme capacity, adjournments due to lack of court time, witness availability, parties affected by COVID-19 etc. Where the value is marked as N/A, this means that there were no evidence led trials in the period therefore an average could not be constructed."]
{"$rows_left_out":33}
{"sheet":"4","index":15,"n_rows":8,"n_cols":2,"rows_kept":8,"cut":false,"hidden":false,"merged":[]}
[]
[null,"Back to Index"]
[]
[]
[]
[]
{"$rows_left_out":3}
{"sheet":"Sheriffdom Look up","index":16,"n_rows":102,"n_cols":7,"rows_kept":102,"cut":false,"hidden":true,"merged":[[0,6,3,9]]}
["Court Code","Court Name","Court Type","Sheriffdom Code","Sheriffdom Name",null,"This data is only for The Scottish Courts and Tribunals Service Internal use. Please go to the index tab and navigate as required."]
[9701,"ABERDEEN                  ","Sheriff",2,"Grampian, Highland & Islands"]
[9702,"AIRDRIE                   ","Sheriff",5,"South Strathclyde, Dumfries & Galloway"]
[9703,"ALLOA                     ","Sheriff",6,"Tayside, Central & Fife"]
[9704,"AYR                       ","Sheriff",5,"South Strathclyde, Dumfries & Galloway"]
[9705,"ARBROATH                  ","Sheriff",6,"Tayside, Central & Fife"]
{"$rows_left_out":96}